BDBM50365328 CHEMBL1955927
SMILES: CC[C@H](C)[C@@H]1NC(=O)[C@@H](CCCCNC(=O)[C@H](Cc2ccccc2)NC1=O)NC(=O)N[C@@H](Cc1ccccc1)C(O)=O
InChI Key: InChIKey=RQGNHTKSTALCHU-SSKCBDBQSA-N
Data: 1 IC50
Activity Spreadsheet -- Enzyme Inhibition Constant Data from BindingDB
Found 1 hit for monomerid = 50365328
Trg + Lig
Ki
nM
ΔG°
kcal/mole
IC50
nM
Kd
nM
EC50/IC50
nM
koff
s-1
kon
M-1s-1
pHTemp
°C
Carboxypeptidase A1
(Bos taurus (bovine))
BDBM50365328
(CHEMBL1955927)
Show SMILES CC[C@H](C)[C@@H]1NC(=O)[C@@H](CCCCNC(=O)[C@H](Cc2ccccc2)NC1=O)NC(=O)N[C@@H](Cc1ccccc1)C(O)=O |r|
Show InChI InChI=1S/C31H41N5O6/c1-3-20(2)26-29(39)33-24(18-21-12-6-4-7-13-21)27(37)32-17-11-10-16-23(28(38)36-26)34-31(42)35-25(30(40)41)19-22-14-8-5-9-15-22/h4-9,12-15,20,23-26H,3,10-11,16-19H2,1-2H3,(H,32,37)(H,33,39)(H,36,38)(H,40,41)(H2,34,35,42)/t20-,23+,24-,25-,26-/m0/s1
n/an/a 250n/an/an/an/an/an/a
National Institute of Diabetes and Digestive and Kidney Diseases
Curated by ChEMBL
Assay Description
Inhibition of bovine pancreas carboxypeptidase A using N-(4-methoxyphenylazoformyl)-phenylalanine as substrate after 5 mins by colorimetry
J Med Chem 55: 735-42 (2012)
Article DOI: 10.1021/jm201238p
BindingDB Entry DOI: 10.7270/Q24F1R7Z