BDBM50365485 CHEMBL1957373
SMILES: Oc1c(C#N)c(nc2ccncc12)-c1ccc(cc1)-c1ccccc1C#N
InChI Key: InChIKey=KLULJQJGHMJEMB-UHFFFAOYSA-N
Data: 1 IC50
Activity Spreadsheet -- Enzyme Inhibition Constant Data from BindingDB
Found 1 hit for monomerid = 50365485
Trg + Lig
Ki
nM
ΔG°
kcal/mole
IC50
nM
Kd
nM
EC50/IC50
nM
koff
s-1
kon
M-1s-1
pHTemp
°C
cAMP and cAMP-inhibited cGMP 3',5'-cyclic phosphodiesterase 10A
(Homo sapiens (Human))
BDBM50365485
(CHEMBL1957373)
Show SMILES Oc1c(C#N)c(nc2ccncc12)-c1ccc(cc1)-c1ccccc1C#N
Show InChI InChI=1S/C22H12N4O/c23-11-16-3-1-2-4-17(16)14-5-7-15(8-6-14)21-18(12-24)22(27)19-13-25-10-9-20(19)26-21/h1-10,13H,(H,26,27)
Reactome pathway
n/an/a 21n/an/an/an/an/an/a
AstraZeneca
Curated by ChEMBL
Assay Description
Inhibition of human recombinant full length PDE10A using cAMP as substrate preincubated for 20 mins measured after 4 hrs
Bioorg Med Chem Lett 22: 1944-8 (2012)
Article DOI: 10.1016/j.bmcl.2012.01.046
BindingDB Entry DOI: 10.7270/Q2KH0NTP