BDBM50365488 CHEMBL1957365
SMILES: OCc1ccccc1-c1ccc(cc1)-c1nc2ccncc2c(O)c1C#N
InChI Key: InChIKey=XVZAEAACKTYAQO-UHFFFAOYSA-N
Data: 1 IC50
Activity Spreadsheet -- Enzyme Inhibition Constant Data from BindingDB
Found 1 hit for monomerid = 50365488
Trg + Lig
Ki
nM
ΔG°
kcal/mole
IC50
nM
Kd
nM
EC50/IC50
nM
koff
s-1
kon
M-1s-1
pHTemp
°C
cAMP and cAMP-inhibited cGMP 3',5'-cyclic phosphodiesterase 10A
(Homo sapiens (Human))
BDBM50365488
(CHEMBL1957365)
Show SMILES OCc1ccccc1-c1ccc(cc1)-c1nc2ccncc2c(O)c1C#N
Show InChI InChI=1S/C22H15N3O2/c23-11-18-21(25-20-9-10-24-12-19(20)22(18)27)15-7-5-14(6-8-15)17-4-2-1-3-16(17)13-26/h1-10,12,26H,13H2,(H,25,27)
Reactome pathway
n/an/a 108n/an/an/an/an/an/a
AstraZeneca
Curated by ChEMBL
Assay Description
Inhibition of human recombinant full length PDE10A using cAMP as substrate preincubated for 20 mins measured after 4 hrs
Bioorg Med Chem Lett 22: 1944-8 (2012)
Article DOI: 10.1016/j.bmcl.2012.01.046
BindingDB Entry DOI: 10.7270/Q2KH0NTP