BDBM50365500 CHEMBL1957462
SMILES: Cc1nn(C)c(C)c1-c1ccc(cc1)-c1nc2ccncc2c(O)c1C#N
InChI Key: InChIKey=BFGMQGPZOKNHIO-UHFFFAOYSA-N
Data: 2 IC50
Activity Spreadsheet -- Enzyme Inhibition Constant Data from BindingDB
Found 2 hits for monomerid = 50365500
Trg + Lig
Ki
nM
ΔG°
kcal/mole
IC50
nM
Kd
nM
EC50/IC50
nM
koff
s-1
kon
M-1s-1
pHTemp
°C
Dihydroorotate dehydrogenase
(Homo sapiens (Human))
BDBM50365500
(CHEMBL1957462)
Show SMILES Cc1nn(C)c(C)c1-c1ccc(cc1)-c1nc2ccncc2c(O)c1C#N
Show InChI InChI=1S/C21H17N5O/c1-12-19(13(2)26(3)25-12)14-4-6-15(7-5-14)20-16(10-22)21(27)17-11-23-9-8-18(17)24-20/h4-9,11H,1-3H3,(H,24,27)
Reactome pathway
n/an/a 1.10E+3n/an/an/an/an/an/a
AstraZeneca
Curated by ChEMBL
Assay Description
Inhibition of human recombinant DHODH transmembrane domain using 2,6-dichloroindophenol sodium, L-Dihydroorotic acid, and decylubiquinone as substrat...
Bioorg Med Chem Lett 22: 1944-8 (2012)
Article DOI: 10.1016/j.bmcl.2012.01.046
BindingDB Entry DOI: 10.7270/Q2KH0NTP
cAMP and cAMP-inhibited cGMP 3',5'-cyclic phosphodiesterase 10A
(Homo sapiens (Human))
BDBM50365500
(CHEMBL1957462)
Show SMILES Cc1nn(C)c(C)c1-c1ccc(cc1)-c1nc2ccncc2c(O)c1C#N
Show InChI InChI=1S/C21H17N5O/c1-12-19(13(2)26(3)25-12)14-4-6-15(7-5-14)20-16(10-22)21(27)17-11-23-9-8-18(17)24-20/h4-9,11H,1-3H3,(H,24,27)
Reactome pathway
n/an/a 13n/an/an/an/an/an/a
AstraZeneca
Curated by ChEMBL
Assay Description
Inhibition of human recombinant full length PDE10A using cAMP as substrate preincubated for 20 mins measured after 4 hrs
Bioorg Med Chem Lett 22: 1944-8 (2012)
Article DOI: 10.1016/j.bmcl.2012.01.046
BindingDB Entry DOI: 10.7270/Q2KH0NTP