BDBM50365709 CHEMBL1958413
SMILES: O=c1cc(nc(NCc2ccccc2)[nH]1)-c1c[nH]c2ncccc12
InChI Key: InChIKey=LBQYEFVUBRVLEX-UHFFFAOYSA-N
Data: 1 EC50
Activity Spreadsheet -- Enzyme Inhibition Constant Data from BindingDB
Found 1 hit for monomerid = 50365709
Trg + Lig
Ki
nM
ΔG°
kcal/mole
IC50
nM
Kd
nM
EC50/IC50
nM
koff
s-1
kon
M-1s-1
pHTemp
°C
CDC7 and DBF4
(Homo sapiens (Human))
BDBM50365709
(CHEMBL1958413)
Show SMILES O=c1cc(nc(NCc2ccccc2)[nH]1)-c1c[nH]c2ncccc12
Show InChI InChI=1S/C18H15N5O/c24-16-9-15(14-11-20-17-13(14)7-4-8-19-17)22-18(23-16)21-10-12-5-2-1-3-6-12/h1-9,11H,10H2,(H,19,20)(H2,21,22,23,24)
n/an/an/an/a 180n/an/an/an/a
Abbott Laboratories
Curated by ChEMBL
Assay Description
Inhibition of CDC7/DBF4-mediated MCM2 phosphorylation in human HCT116 cells after 6 hrs by spectrophotometric analysis
Bioorg Med Chem Lett 22: 1940-3 (2012)
Article DOI: 10.1016/j.bmcl.2012.01.041
BindingDB Entry DOI: 10.7270/Q2DR2W0F