null
SMILES: O=C1NCc2cc(ccc12)-c1cnc(Nc2ccc(cc2)N2CCOCC2)c2nccn12
InChI Key: InChIKey=PMFMZQFBDGJDMA-UHFFFAOYSA-N
Activity Spreadsheet -- Enzyme Inhibition Constant Data from BindingDB
Found 2 hits for monomerid = 50365795
Trg + Lig
Ki
nM
ΔG°
kcal/mole
IC50
nM
Kd
nM
EC50/IC50
nM
koff
s-1
kon
M-1s-1
pHTemp
°C
MAP kinase-activated protein kinase 5
(Homo sapiens (Human))
BDBM50365795
(CHEMBL1956574)
Show SMILES O=C1NCc2cc(ccc12)-c1cnc(Nc2ccc(cc2)N2CCOCC2)c2nccn12
Show InChI InChI=1S/C24H22N6O2/c31-24-20-6-1-16(13-17(20)14-27-24)21-15-26-22(23-25-7-8-30(21)23)28-18-2-4-19(5-3-18)29-9-11-32-12-10-29/h1-8,13,15H,9-12,14H2,(H,26,28)(H,27,31)
NCI pathway
Reactome pathway
n/an/a 676n/an/an/an/an/an/a
Galapagos NV
Curated by ChEMBL
Assay Description
Inhibition of MAPKAPK5 in syonovial fibroblast from rheumatoid arthritis patient assessed as inhibition of TNF-alpha-induced MMP1 expression incubate...
Bioorg Med Chem Lett 22: 2266-70 (2012)
Article DOI: 10.1016/j.bmcl.2012.01.077
BindingDB Entry DOI: 10.7270/Q2CR5TT6
MAP kinase-activated protein kinase 5
(Homo sapiens (Human))
BDBM50365795
(CHEMBL1956574)
Show SMILES O=C1NCc2cc(ccc12)-c1cnc(Nc2ccc(cc2)N2CCOCC2)c2nccn12
Show InChI InChI=1S/C24H22N6O2/c31-24-20-6-1-16(13-17(20)14-27-24)21-15-26-22(23-25-7-8-30(21)23)28-18-2-4-19(5-3-18)29-9-11-32-12-10-29/h1-8,13,15H,9-12,14H2,(H,26,28)(H,27,31)
NCI pathway
Reactome pathway
n/an/a 239n/an/an/an/an/an/a
Galapagos NV
Curated by ChEMBL
Assay Description
Inhibition of MAPKAPK5
Bioorg Med Chem Lett 22: 2266-70 (2012)
Article DOI: 10.1016/j.bmcl.2012.01.077
BindingDB Entry DOI: 10.7270/Q2CR5TT6