BDBM50366002 CHEMBL1956439
SMILES: Clc1ccc(CCC(=O)Nc2sc3CCCCc3c2C#N)cc1
InChI Key: InChIKey=AOWKQMUGAQZWET-UHFFFAOYSA-N
Data: 1 IC50
Activity Spreadsheet -- Enzyme Inhibition Constant Data from BindingDB
Found 1 hit for monomerid = 50366002
Trg + Lig
Ki
nM
ΔG°
kcal/mole
IC50
nM
Kd
nM
EC50/IC50
nM
koff
s-1
kon
M-1s-1
pHTemp
°C
Vasoactive intestinal polypeptide receptor 1
(Rattus norvegicus)
BDBM50366002
(CHEMBL1956439)
Show SMILES Clc1ccc(CCC(=O)Nc2sc3CCCCc3c2C#N)cc1
Show InChI InChI=1S/C18H17ClN2OS/c19-13-8-5-12(6-9-13)7-10-17(22)21-18-15(11-20)14-3-1-2-4-16(14)23-18/h5-6,8-9H,1-4,7,10H2,(H,21,22)
n/an/a 1.20E+3n/an/an/an/an/an/a
Bristol-Myers Squibb Co.
Curated by ChEMBL
Assay Description
Antagonist activity at vasoactive intestinal peptide receptor 1 in rat RKE cells assessed as inhibition of VIP-induced intracellular cAMP accumulatio...
Bioorg Med Chem Lett 22: 2287-90 (2012)
Article DOI: 10.1016/j.bmcl.2012.01.082
BindingDB Entry DOI: 10.7270/Q2Q240QR