BDBM50366016 CHEMBL1956417
SMILES: CC(C)c1cc(cc(c1CO)-c1ccc(cc1)-c1ccccc1)C(C)(C)C
InChI Key: InChIKey=MAUQDQHFSQYTAL-UHFFFAOYSA-N
Data: 1 IC50
Activity Spreadsheet -- Enzyme Inhibition Constant Data from BindingDB
Found 1 hit for monomerid = 50366016
Trg + Lig
Ki
nM
ΔG°
kcal/mole
IC50
nM
Kd
nM
EC50/IC50
nM
koff
s-1
kon
M-1s-1
pHTemp
°C
Vasoactive intestinal polypeptide receptor 1
(Rattus norvegicus)
BDBM50366016
(CHEMBL1956417)
Show SMILES CC(C)c1cc(cc(c1CO)-c1ccc(cc1)-c1ccccc1)C(C)(C)C
Show InChI InChI=1S/C26H30O/c1-18(2)23-15-22(26(3,4)5)16-24(25(23)17-27)21-13-11-20(12-14-21)19-9-7-6-8-10-19/h6-16,18,27H,17H2,1-5H3
n/an/a 680n/an/an/an/an/an/a
Bristol-Myers Squibb Co.
Curated by ChEMBL
Assay Description
Antagonist activity at vasoactive intestinal peptide receptor 1 in rat RKE cells assessed as inhibition of VIP-induced intracellular cAMP accumulatio...
Bioorg Med Chem Lett 22: 2287-90 (2012)
Article DOI: 10.1016/j.bmcl.2012.01.082
BindingDB Entry DOI: 10.7270/Q2Q240QR