BDBM50366152 CHEMBL1957442
SMILES: Cc1ccc(cc1)-c1cn([C@@H]2O[C@H](CCP(O)(O)=O)[C@@H](O)[C@H]2O)c(=O)[nH]c1=O
InChI Key: InChIKey=XPWLJVZHVNTSLI-IXYNUQLISA-N
Data: 1 EC50
Activity Spreadsheet -- Enzyme Inhibition Constant Data from BindingDB
Found 1 hit for monomerid = 50366152
Trg + Lig
Ki
nM
ΔG°
kcal/mole
IC50
nM
Kd
nM
EC50/IC50
nM
koff
s-1
kon
M-1s-1
pHTemp
°C
Purinergic receptor P2Y2
(Homo sapiens (Human))
BDBM50366152
(CHEMBL1957442)
Show SMILES Cc1ccc(cc1)-c1cn([C@@H]2O[C@H](CCP(O)(O)=O)[C@@H](O)[C@H]2O)c(=O)[nH]c1=O |r|
Show InChI InChI=1S/C17H21N2O8P/c1-9-2-4-10(5-3-9)11-8-19(17(23)18-15(11)22)16-14(21)13(20)12(27-16)6-7-28(24,25)26/h2-5,8,12-14,16,20-21H,6-7H2,1H3,(H,18,22,23)(H2,24,25,26)/t12-,13-,14-,16-/m1/s1
Reactome pathway
n/an/an/an/a 1.00E+3n/an/an/an/a
Ghent University
Curated by ChEMBL
Assay Description
Agonist activity at human P2Y2 receptor expressed in human 1321N1 cells assessed as stimulation of PLC-induced [3H]inositol phosphate production afte...
Bioorg Med Chem 20: 2304-15 (2012)
Article DOI: 10.1016/j.bmc.2012.02.012
BindingDB Entry DOI: 10.7270/Q2WM1DWW