BDBM50366153 CHEMBL1957441
SMILES: O[C@@H]1[C@@H](CCP(O)(O)=O)O[C@H]([C@@H]1O)n1cc(C=Cc2ccccc2)c(=O)[nH]c1=O
InChI Key: InChIKey=POVBNHRJUINLSB-KCYZZUKISA-N
Data: 1 EC50
Activity Spreadsheet -- Enzyme Inhibition Constant Data from BindingDB
Found 1 hit for monomerid = 50366153
Trg + Lig
Ki
nM
ΔG°
kcal/mole
IC50
nM
Kd
nM
EC50/IC50
nM
koff
s-1
kon
M-1s-1
pHTemp
°C
Purinergic receptor P2Y2
(Homo sapiens (Human))
BDBM50366153
(CHEMBL1957441)
Show SMILES O[C@@H]1[C@@H](CCP(O)(O)=O)O[C@H]([C@@H]1O)n1cc(C=Cc2ccccc2)c(=O)[nH]c1=O |r,w:16.16|
Show InChI InChI=1S/C18H21N2O8P/c21-14-13(8-9-29(25,26)27)28-17(15(14)22)20-10-12(16(23)19-18(20)24)7-6-11-4-2-1-3-5-11/h1-7,10,13-15,17,21-22H,8-9H2,(H,19,23,24)(H2,25,26,27)/t13-,14-,15-,17-/m1/s1
Reactome pathway
n/an/an/an/a 3.10E+3n/an/an/an/a
Ghent University
Curated by ChEMBL
Assay Description
Agonist activity at human P2Y2 receptor expressed in human 1321N1 cells assessed as stimulation of PLC-induced [3H]inositol phosphate production afte...
Bioorg Med Chem 20: 2304-15 (2012)
Article DOI: 10.1016/j.bmc.2012.02.012
BindingDB Entry DOI: 10.7270/Q2WM1DWW