BDBM50366517 CHEMBL1790303
SMILES: CC[C@H](C)[C@H](NC(=O)[C@H](CC(O)=O)NC(=O)[C@@H](N)CC(O)=O)C(=O)N[C@@H](C(C)C)C(=O)N1CCC[C@H]1C(=O)N[C@@H](CS)C(O)=O
InChI Key: InChIKey=MCKZLTPEGNGXFT-GPYRIXEGSA-N
Data: 1 KI  2 IC50
Activity Spreadsheet -- Enzyme Inhibition Constant Data from BindingDB
Found 3 hits for monomerid = 50366517
Trg + Lig
Ki
nM
ΔG°
kcal/mole
IC50
nM
Kd
nM
EC50/IC50
nM
koff
s-1
kon
M-1s-1
pHTemp
°C
Hepatitis C virus serine protease, NS3/NS4A
(Hepatitis C virus)
BDBM50366517
(CHEMBL1790303)
Show SMILES CC[C@H](C)[C@H](NC(=O)[C@H](CC(O)=O)NC(=O)[C@@H](N)CC(O)=O)C(=O)N[C@@H](C(C)C)C(=O)N1CCC[C@H]1C(=O)N[C@@H](CS)C(O)=O
Show InChI InChI=1S/C27H44N6O11S/c1-5-13(4)21(32-23(39)15(10-19(36)37)29-22(38)14(28)9-18(34)35)25(41)31-20(12(2)3)26(42)33-8-6-7-17(33)24(40)30-16(11-45)27(43)44/h12-17,20-21,45H,5-11,28H2,1-4H3,(H,29,38)(H,30,40)(H,31,41)(H,32,39)(H,34,35)(H,36,37)(H,43,44)/t13-,14-,15-,16-,17-,20-,21-/m0/s1
1.40E+4n/an/an/an/an/an/an/an/a
Boehringer Ingelheim (Canada) Ltd.
Curated by ChEMBL
Assay Description
The apparent Ki value against NS3-4Apep protease
Bioorg Med Chem Lett 8: 1713-8 (1999)
BindingDB Entry DOI: 10.7270/Q2Z89CX4
Hepatitis C virus serine protease, NS3/NS4A
(Hepatitis C virus)
BDBM50366517
(CHEMBL1790303)
Show SMILES CC[C@H](C)[C@H](NC(=O)[C@H](CC(O)=O)NC(=O)[C@@H](N)CC(O)=O)C(=O)N[C@@H](C(C)C)C(=O)N1CCC[C@H]1C(=O)N[C@@H](CS)C(O)=O
Show InChI InChI=1S/C27H44N6O11S/c1-5-13(4)21(32-23(39)15(10-19(36)37)29-22(38)14(28)9-18(34)35)25(41)31-20(12(2)3)26(42)33-8-6-7-17(33)24(40)30-16(11-45)27(43)44/h12-17,20-21,45H,5-11,28H2,1-4H3,(H,29,38)(H,30,40)(H,31,41)(H,32,39)(H,34,35)(H,36,37)(H,43,44)/t13-,14-,15-,16-,17-,20-,21-/m0/s1
n/an/a 7.10E+4n/an/an/an/an/an/a
Boehringer Ingelheim
Curated by ChEMBL
Assay Description
Inhibitory activity against NS3 protease complexed with NS4A cofactor peptide (NS3-4A pep)
Bioorg Med Chem Lett 10: 2267-70 (2001)
BindingDB Entry DOI: 10.7270/Q2S1831T
Hepatitis C virus serine protease, NS3/NS4A
(Hepatitis C virus)
BDBM50366517
(CHEMBL1790303)
Show SMILES CC[C@H](C)[C@H](NC(=O)[C@H](CC(O)=O)NC(=O)[C@@H](N)CC(O)=O)C(=O)N[C@@H](C(C)C)C(=O)N1CCC[C@H]1C(=O)N[C@@H](CS)C(O)=O
Show InChI InChI=1S/C27H44N6O11S/c1-5-13(4)21(32-23(39)15(10-19(36)37)29-22(38)14(28)9-18(34)35)25(41)31-20(12(2)3)26(42)33-8-6-7-17(33)24(40)30-16(11-45)27(43)44/h12-17,20-21,45H,5-11,28H2,1-4H3,(H,29,38)(H,30,40)(H,31,41)(H,32,39)(H,34,35)(H,36,37)(H,43,44)/t13-,14-,15-,16-,17-,20-,21-/m0/s1
n/an/a 7.10E+4n/an/an/an/an/an/a
Boehringer Ingelheim (Canada) Ltd.
Curated by ChEMBL
Assay Description
Inhibitory activity against NS3-4A pep protease
Bioorg Med Chem Lett 8: 1713-8 (1999)
BindingDB Entry DOI: 10.7270/Q2Z89CX4