BDBM50366571 CHEMBL1788261
SMILES: CCN1CCN(C)C[C@@H](C1)NC(=O)c1cc(Cl)c(NC)cc1OC
InChI Key: InChIKey=WKQKHFBNIGVTEQ-LBPRGKRZSA-N
Data: 2 IC50
Activity Spreadsheet -- Enzyme Inhibition Constant Data from BindingDB
Found 2 hits for monomerid = 50366571
Trg + Lig
Ki
nM
ΔG°
kcal/mole
IC50
nM
Kd
nM
EC50/IC50
nM
koff
s-1
kon
M-1s-1
pHTemp
°C
Serotonin 3a (5-HT3a)/3b (5-HT3b) receptor
(Rattus norvegicus-RAT)
BDBM50366571
(CHEMBL1788261)
Show SMILES CCN1CCN(C)C[C@@H](C1)NC(=O)c1cc(Cl)c(NC)cc1OC |r|
Show InChI InChI=1S/C17H27ClN4O2/c1-5-22-7-6-21(3)10-12(11-22)20-17(23)13-8-14(18)15(19-2)9-16(13)24-4/h8-9,12,19H,5-7,10-11H2,1-4H3,(H,20,23)/t12-/m0/s1
n/an/a 1.5n/an/an/an/an/an/a
Dainippon Pharmaceutical Co., Ltd.
Curated by ChEMBL
Assay Description
Binding affinity against 5-hydroxytryptamine 3 receptor in rat cortical membrane using [3H]GR-65630 as radioligand
Bioorg Med Chem Lett 8: 619-24 (1999)
BindingDB Entry DOI: 10.7270/Q25Q4WN6
D(2) dopamine receptor
(Rattus norvegicus (rat))
BDBM50366571
(CHEMBL1788261)
Show SMILES CCN1CCN(C)C[C@@H](C1)NC(=O)c1cc(Cl)c(NC)cc1OC |r|
Show InChI InChI=1S/C17H27ClN4O2/c1-5-22-7-6-21(3)10-12(11-22)20-17(23)13-8-14(18)15(19-2)9-16(13)24-4/h8-9,12,19H,5-7,10-11H2,1-4H3,(H,20,23)/t12-/m0/s1
Reactome pathway
n/an/a 320n/an/an/an/an/an/a
Dainippon Pharmaceutical Co., Ltd.
Curated by ChEMBL
Assay Description
Binding affinity against dopamine D2 receptor in rat brain synaptic membrane using [3H]-spiperone as radioligand
Bioorg Med Chem Lett 8: 619-24 (1999)
BindingDB Entry DOI: 10.7270/Q25Q4WN6