BDBM50366580 CHEMBL611122
SMILES: NC(=N)NCCC[C@@H](NC(=O)[C@@H](CCCNC(N)=N)NC(=O)[C@@H](CCCNC(N)=N)NC(=O)[C@@H](CCCNC(N)=N)NC(=O)[C@@H](CCCNC(N)=N)NC(=O)[C@@H](CCCNC(N)=N)NC(=O)CCNC(=O)[C@H]1OC([C@H](O)[C@@H]1O)n1cnc2c(N)ncnc12)C(O)=O
InChI Key: InChIKey=SKHJPFQNPQEHHQ-VOMWTDLXSA-N
Data: 2 IC50
Activity Spreadsheet -- Enzyme Inhibition Constant Data from BindingDB
Found 2 hits for monomerid = 50366580
Trg + Lig
Ki
nM
ΔG°
kcal/mole
IC50
nM
Kd
nM
EC50/IC50
nM
koff
s-1
kon
M-1s-1
pHTemp
°C
Calcium dependent protein kinase
(Zea mays)
BDBM50366580
(CHEMBL611122)
Show SMILES NC(=N)NCCC[C@@H](NC(=O)[C@@H](CCCNC(N)=N)NC(=O)[C@@H](CCCNC(N)=N)NC(=O)[C@@H](CCCNC(N)=N)NC(=O)[C@@H](CCCNC(N)=N)NC(=O)[C@@H](CCCNC(N)=N)NC(=O)CCNC(=O)[C@H]1OC([C@H](O)[C@@H]1O)n1cnc2c(N)ncnc12)C(O)=O |r|
Show InChI InChI=1S/C49H88N30O12/c50-34-30-35(71-21-70-34)79(22-72-30)42-32(82)31(81)33(91-42)41(88)63-20-13-29(80)73-23(7-1-14-64-44(51)52)36(83)74-24(8-2-15-65-45(53)54)37(84)75-25(9-3-16-66-46(55)56)38(85)76-26(10-4-17-67-47(57)58)39(86)77-27(11-5-18-68-48(59)60)40(87)78-28(43(89)90)12-6-19-69-49(61)62/h21-28,31-33,42,81-82H,1-20H2,(H,63,88)(H,73,80)(H,74,83)(H,75,84)(H,76,85)(H,77,86)(H,78,87)(H,89,90)(H2,50,70,71)(H4,51,52,64)(H4,53,54,65)(H4,55,56,66)(H4,57,58,67)(H4,59,60,68)(H4,61,62,69)/t23-,24-,25-,26-,27-,28-,31+,32-,33+,42?/m1/s1
n/an/a 3.80E+4n/an/an/an/an/an/a
Tartu University
Curated by ChEMBL
Assay Description
Inhibition of Calcium-dependent protein kinase 1 (CDPK-1) from maize seedlings
Bioorg Med Chem Lett 9: 1447-52 (1999)
BindingDB Entry DOI: 10.7270/Q2RF5VJB
Protein kinase C beta type
(Homo sapiens (Human))
BDBM50366580
(CHEMBL611122)
Show SMILES NC(=N)NCCC[C@@H](NC(=O)[C@@H](CCCNC(N)=N)NC(=O)[C@@H](CCCNC(N)=N)NC(=O)[C@@H](CCCNC(N)=N)NC(=O)[C@@H](CCCNC(N)=N)NC(=O)[C@@H](CCCNC(N)=N)NC(=O)CCNC(=O)[C@H]1OC([C@H](O)[C@@H]1O)n1cnc2c(N)ncnc12)C(O)=O |r|
Show InChI InChI=1S/C49H88N30O12/c50-34-30-35(71-21-70-34)79(22-72-30)42-32(82)31(81)33(91-42)41(88)63-20-13-29(80)73-23(7-1-14-64-44(51)52)36(83)74-24(8-2-15-65-45(53)54)37(84)75-25(9-3-16-66-46(55)56)38(85)76-26(10-4-17-67-47(57)58)39(86)77-27(11-5-18-68-48(59)60)40(87)78-28(43(89)90)12-6-19-69-49(61)62/h21-28,31-33,42,81-82H,1-20H2,(H,63,88)(H,73,80)(H,74,83)(H,75,84)(H,76,85)(H,77,86)(H,78,87)(H,89,90)(H2,50,70,71)(H4,51,52,64)(H4,53,54,65)(H4,55,56,66)(H4,57,58,67)(H4,59,60,68)(H4,61,62,69)/t23-,24-,25-,26-,27-,28-,31+,32-,33+,42?/m1/s1
NCI pathway
Reactome pathway
n/an/a 3.00E+3n/an/an/an/an/an/a
Tartu University
Curated by ChEMBL
Assay Description
Inhibitory activity against Protein kinase C beta isoform (PKC) from pig spleen.
Bioorg Med Chem Lett 9: 1447-52 (1999)
BindingDB Entry DOI: 10.7270/Q2RF5VJB