BDBM50366583 CHEMBL610874
SMILES: NC(=N)NCCC[C@@H](NC(=O)[C@@H](CCCNC(N)=N)NC(=O)[C@@H](CCCNC(N)=N)NC(=O)[C@@H](CCCNC(N)=N)NC(=O)[C@@H](CCCNC(N)=N)NC(=O)[C@@H](CCCNC(N)=N)NC(=O)CCCCCNC(=O)[C@H]1OC([C@H](O)[C@@H]1O)n1cnc2c(N)ncnc12)C(O)=O
InChI Key: InChIKey=QLSCMEHEXBNFGR-FBEAYKSBSA-N
Data: 2 IC50
Activity Spreadsheet -- Enzyme Inhibition Constant Data from BindingDB
Found 2 hits for monomerid = 50366583
Trg + Lig
Ki
nM
ΔG°
kcal/mole
IC50
nM
Kd
nM
EC50/IC50
nM
koff
s-1
kon
M-1s-1
pHTemp
°C
Protein kinase C beta type
(Homo sapiens (Human))
BDBM50366583
(CHEMBL610874)
Show SMILES NC(=N)NCCC[C@@H](NC(=O)[C@@H](CCCNC(N)=N)NC(=O)[C@@H](CCCNC(N)=N)NC(=O)[C@@H](CCCNC(N)=N)NC(=O)[C@@H](CCCNC(N)=N)NC(=O)[C@@H](CCCNC(N)=N)NC(=O)CCCCCNC(=O)[C@H]1OC([C@H](O)[C@@H]1O)n1cnc2c(N)ncnc12)C(O)=O |r|
Show InChI InChI=1S/C52H94N30O12/c53-37-33-38(74-24-73-37)82(25-75-33)45-35(85)34(84)36(94-45)44(91)66-17-3-1-2-16-32(83)76-26(10-4-18-67-47(54)55)39(86)77-27(11-5-19-68-48(56)57)40(87)78-28(12-6-20-69-49(58)59)41(88)79-29(13-7-21-70-50(60)61)42(89)80-30(14-8-22-71-51(62)63)43(90)81-31(46(92)93)15-9-23-72-52(64)65/h24-31,34-36,45,84-85H,1-23H2,(H,66,91)(H,76,83)(H,77,86)(H,78,87)(H,79,88)(H,80,89)(H,81,90)(H,92,93)(H2,53,73,74)(H4,54,55,67)(H4,56,57,68)(H4,58,59,69)(H4,60,61,70)(H4,62,63,71)(H4,64,65,72)/t26-,27-,28-,29-,30-,31-,34+,35-,36+,45?/m1/s1
NCI pathway
Reactome pathway
n/an/a 270n/an/an/an/an/an/a
Tartu University
Curated by ChEMBL
Assay Description
Inhibitory activity against Protein kinase C beta isoform (PKC) from pig spleen.
Bioorg Med Chem Lett 9: 1447-52 (1999)
BindingDB Entry DOI: 10.7270/Q2RF5VJB
Calcium dependent protein kinase
(Zea mays)
BDBM50366583
(CHEMBL610874)
Show SMILES NC(=N)NCCC[C@@H](NC(=O)[C@@H](CCCNC(N)=N)NC(=O)[C@@H](CCCNC(N)=N)NC(=O)[C@@H](CCCNC(N)=N)NC(=O)[C@@H](CCCNC(N)=N)NC(=O)[C@@H](CCCNC(N)=N)NC(=O)CCCCCNC(=O)[C@H]1OC([C@H](O)[C@@H]1O)n1cnc2c(N)ncnc12)C(O)=O |r|
Show InChI InChI=1S/C52H94N30O12/c53-37-33-38(74-24-73-37)82(25-75-33)45-35(85)34(84)36(94-45)44(91)66-17-3-1-2-16-32(83)76-26(10-4-18-67-47(54)55)39(86)77-27(11-5-19-68-48(56)57)40(87)78-28(12-6-20-69-49(58)59)41(88)79-29(13-7-21-70-50(60)61)42(89)80-30(14-8-22-71-51(62)63)43(90)81-31(46(92)93)15-9-23-72-52(64)65/h24-31,34-36,45,84-85H,1-23H2,(H,66,91)(H,76,83)(H,77,86)(H,78,87)(H,79,88)(H,80,89)(H,81,90)(H,92,93)(H2,53,73,74)(H4,54,55,67)(H4,56,57,68)(H4,58,59,69)(H4,60,61,70)(H4,62,63,71)(H4,64,65,72)/t26-,27-,28-,29-,30-,31-,34+,35-,36+,45?/m1/s1
n/an/a 1.20E+3n/an/an/an/an/an/a
Tartu University
Curated by ChEMBL
Assay Description
Inhibition of Calcium-dependent protein kinase 1 (CDPK-1) from maize seedlings
Bioorg Med Chem Lett 9: 1447-52 (1999)
BindingDB Entry DOI: 10.7270/Q2RF5VJB