BDBM50366927 CHEMBL1159471
SMILES: OC[C@H]1OC(Oc2cc(O)c3c(c2)oc(-c2ccc(O)cc2)c(O)c3=O)[C@H](O)[C@@H](O)[C@@H]1O
InChI Key: InChIKey=YPWHZCPMOQGCDQ-CXWQUDHASA-N
Data: 2 IC50
Activity Spreadsheet -- Enzyme Inhibition Constant Data from BindingDB
Found 2 hits for monomerid = 50366927
Trg + Lig
Ki
nM
ΔG°
kcal/mole
IC50
nM
Kd
nM
EC50/IC50
nM
koff
s-1
kon
M-1s-1
pHTemp
°C
Lysozyme C
(Rattus norvegicus)
BDBM50366927
(CHEMBL1159471)
Show SMILES OC[C@H]1OC(Oc2cc(O)c3c(c2)oc(-c2ccc(O)cc2)c(O)c3=O)[C@H](O)[C@@H](O)[C@@H]1O |r|
Show InChI InChI=1S/C21H20O11/c22-7-13-15(25)17(27)19(29)21(32-13)30-10-5-11(24)14-12(6-10)31-20(18(28)16(14)26)8-1-3-9(23)4-2-8/h1-6,13,15,17,19,21-25,27-29H,7H2/t13-,15-,17+,19-,21?/m1/s1
n/an/a>3.00E+4n/an/an/an/an/an/a
Kaohsiung Medical University
Curated by ChEMBL
Assay Description
Inhibitory effect of compound on the release of lysozyme in rat neutrophils stimulated with fMLP/CB
Bioorg Med Chem Lett 14: 1011-4 (2004)
Article DOI: 10.1016/j.bmcl.2003.11.074
BindingDB Entry DOI: 10.7270/Q2C829VG
Beta-glucuronidase
(Rattus norvegicus)
BDBM50366927
(CHEMBL1159471)
Show SMILES OC[C@H]1OC(Oc2cc(O)c3c(c2)oc(-c2ccc(O)cc2)c(O)c3=O)[C@H](O)[C@@H](O)[C@@H]1O |r|
Show InChI InChI=1S/C21H20O11/c22-7-13-15(25)17(27)19(29)21(32-13)30-10-5-11(24)14-12(6-10)31-20(18(28)16(14)26)8-1-3-9(23)4-2-8/h1-6,13,15,17,19,21-25,27-29H,7H2/t13-,15-,17+,19-,21?/m1/s1
n/an/a>3.00E+4n/an/an/an/an/an/a
Kaohsiung Medical University
Curated by ChEMBL
Assay Description
Inhibitory effect of compound on the release of Beta-glucuronidase in rat neutrophils stimulated with fMLP/CB
Bioorg Med Chem Lett 14: 1011-4 (2004)
Article DOI: 10.1016/j.bmcl.2003.11.074
BindingDB Entry DOI: 10.7270/Q2C829VG