BDBM50367263 CHEMBL605047
SMILES: NNC(=O)Cc1ccc(NC(=O)Cc2ccc(Nc3ncnc4n(cnc34)C3O[C@H](CO)[C@@H](O)[C@H]3O)cc2)cc1
InChI Key: InChIKey=FIRBKXKMRHALTH-LDEFLUHMSA-N
Data: 1 KI
Activity Spreadsheet -- Enzyme Inhibition Constant Data from BindingDB
Found 1 hit for monomerid = 50367263
Trg + Lig
Ki
nM
ΔG°
kcal/mole
IC50
nM
Kd
nM
EC50/IC50
nM
koff
s-1
kon
M-1s-1
pHTemp
°C
Adenosine receptor A1
(Rattus norvegicus (rat))
BDBM50367263
(CHEMBL605047)
Show SMILES NNC(=O)Cc1ccc(NC(=O)Cc2ccc(Nc3ncnc4n(cnc34)C3O[C@H](CO)[C@@H](O)[C@H]3O)cc2)cc1 |r|
Show InChI InChI=1S/C26H28N8O6/c27-33-20(37)10-15-1-5-16(6-2-15)31-19(36)9-14-3-7-17(8-4-14)32-24-21-25(29-12-28-24)34(13-30-21)26-23(39)22(38)18(11-35)40-26/h1-8,12-13,18,22-23,26,35,38-39H,9-11,27H2,(H,31,36)(H,33,37)(H,28,29,32)/t18-,22-,23-,26?/m1/s1
Reactome pathway
4.5n/an/an/an/an/an/an/an/a
TBA
Curated by ChEMBL
Assay Description
Inhibition of binding of 1 nM N6-[3H]cyclohexyladenosine to adenosine A1 receptor on rat cerebral cortical membranes.
J Med Chem 28: 1341-6 (1985)
BindingDB Entry DOI: 10.7270/Q2BP03CS