BDBM50367417 CHEMBL1743943
SMILES: Fc1ccc(cc1)-n1c2CCN(CCc3ccccn3)Cc2c2cc(F)ccc12
InChI Key: InChIKey=YDALBQREGQCAPU-UHFFFAOYSA-N
Data: 2 KI
Activity Spreadsheet -- Enzyme Inhibition Constant Data from BindingDB
Found 2 hits for monomerid = 50367417
Trg + Lig
Ki
nM
ΔG°
kcal/mole
IC50
nM
Kd
nM
EC50/IC50
nM
koff
s-1
kon
M-1s-1
pHTemp
°C
Serotonin 2 (5-HT2) receptor
(Rattus norvegicus (rat)-RAT-Rattus norvegicus (Rat...)
BDBM50367417
(CHEMBL1743943)
Show SMILES Fc1ccc(cc1)-n1c2CCN(CCc3ccccn3)Cc2c2cc(F)ccc12
Show InChI InChI=1S/C24H21F2N3/c25-17-4-7-20(8-5-17)29-23-9-6-18(26)15-21(23)22-16-28(14-11-24(22)29)13-10-19-3-1-2-12-27-19/h1-9,12,15H,10-11,13-14,16H2
3.60n/an/an/an/an/an/an/an/a
Wyeth Laboratories
Curated by ChEMBL
Assay Description
In vitro 5-hydroxytryptamine 2 receptor affinity by using [3H]spiperone as the radioligand in rat cortical tissue; value may range from 2.4 to 5.3
J Med Chem 30: 1818-23 (1987)
BindingDB Entry DOI: 10.7270/Q2NS0VG2
D(2) dopamine receptor
(Rattus norvegicus (rat))
BDBM50367417
(CHEMBL1743943)
Show SMILES Fc1ccc(cc1)-n1c2CCN(CCc3ccccn3)Cc2c2cc(F)ccc12
Show InChI InChI=1S/C24H21F2N3/c25-17-4-7-20(8-5-17)29-23-9-6-18(26)15-21(23)22-16-28(14-11-24(22)29)13-10-19-3-1-2-12-27-19/h1-9,12,15H,10-11,13-14,16H2
Reactome pathway
7n/an/an/an/an/an/an/an/a
Wyeth Laboratories
Curated by ChEMBL
Assay Description
In vitro Dopamine receptor D2 affinity by using [3H]spiperone as the radioligand in rat limbic system at 1 uM concentration of compound ; value may r...
J Med Chem 30: 1818-23 (1987)
BindingDB Entry DOI: 10.7270/Q2NS0VG2