BDBM50367419 CHEMBL1743958
SMILES: Fc1ccc(cc1)-n1c2CCN(CCc3cnccn3)Cc2c2cc(F)ccc12
InChI Key: InChIKey=KAEOLIMAQYKEQB-UHFFFAOYSA-N
Data: 2 KI
Activity Spreadsheet -- Enzyme Inhibition Constant Data from BindingDB
Found 2 hits for monomerid = 50367419
Trg + Lig
Ki
nM
ΔG°
kcal/mole
IC50
nM
Kd
nM
EC50/IC50
nM
koff
s-1
kon
M-1s-1
pHTemp
°C
D(2) dopamine receptor
(Rattus norvegicus (rat))
BDBM50367419
(CHEMBL1743958)
Show SMILES Fc1ccc(cc1)-n1c2CCN(CCc3cnccn3)Cc2c2cc(F)ccc12
Show InChI InChI=1S/C23H20F2N4/c24-16-1-4-19(5-2-16)29-22-6-3-17(25)13-20(22)21-15-28(12-8-23(21)29)11-7-18-14-26-9-10-27-18/h1-6,9-10,13-14H,7-8,11-12,15H2
Reactome pathway
5n/an/an/an/an/an/an/an/a
Wyeth Laboratories
Curated by ChEMBL
Assay Description
In vitro Dopamine receptor D2 affinity by using [3H]spiperone as the radioligand in rat limbic system at 1 uM concentration of compound ; value may r...
J Med Chem 30: 1818-23 (1987)
BindingDB Entry DOI: 10.7270/Q2NS0VG2
Serotonin 2 (5-HT2) receptor
(Rattus norvegicus (rat)-RAT-Rattus norvegicus (Rat...)
BDBM50367419
(CHEMBL1743958)
Show SMILES Fc1ccc(cc1)-n1c2CCN(CCc3cnccn3)Cc2c2cc(F)ccc12
Show InChI InChI=1S/C23H20F2N4/c24-16-1-4-19(5-2-16)29-22-6-3-17(25)13-20(22)21-15-28(12-8-23(21)29)11-7-18-14-26-9-10-27-18/h1-6,9-10,13-14H,7-8,11-12,15H2
23n/an/an/an/an/an/an/an/a
Wyeth Laboratories
Curated by ChEMBL
Assay Description
In vitro 5-hydroxytryptamine 2 receptor affinity by using [3H]spiperone as the radioligand in rat cortical tissue; value may range from 6 to 75
J Med Chem 30: 1818-23 (1987)
BindingDB Entry DOI: 10.7270/Q2NS0VG2