null
SMILES: Fc1cc2OCCCCn3cnnc3-c3cccc(NC(=O)c2cc1-c1ccc(nc1)C1CC1)n3
InChI Key:
Activity Spreadsheet -- Enzyme Inhibition Constant Data from BindingDB
Found 2 hits for monomerid = 503676
Trg + Lig
Ki
nM
ΔG°
kcal/mole
IC50
nM
Kd
nM
EC50/IC50
nM
koff
s-1
kon
M-1s-1
pHTemp
°C
Mitogen-activated protein kinase kinase kinase 5
(Homo sapiens (Human))
BDBM503676
(US11034671, Example 68 | US11168095, Example 59)
Show SMILES Fc1cc2OCCCCn3cnnc3-c3cccc(NC(=O)c2cc1-c1ccc(nc1)C1CC1)n3
n/an/a<100n/an/an/an/an/an/a
TBA
Citation and Details
BindingDB Entry DOI: 10.7270/Q25M68V5
Mitogen-activated protein kinase kinase kinase 5
(Homo sapiens (Human))
BDBM503676
(US11034671, Example 68 | US11168095, Example 59)
Show SMILES Fc1cc2OCCCCn3cnnc3-c3cccc(NC(=O)c2cc1-c1ccc(nc1)C1CC1)n3
n/an/an/a<100n/an/an/an/an/a
TBA
Citation and Details
BindingDB Entry DOI: 10.7270/Q2S185M8