BDBM50368599 CHEMBL1159809
SMILES: CS(=O)CCC(N)CS
InChI Key: InChIKey=NIAJBPNCQFEPJW-UHFFFAOYSA-N
Data: 2 IC50
Activity Spreadsheet -- Enzyme Inhibition Constant Data from BindingDB
Found 2 hits for monomerid = 50368599
Trg + Lig
Ki
nM
ΔG°
kcal/mole
IC50
nM
Kd
nM
EC50/IC50
nM
koff
s-1
kon
M-1s-1
pHTemp
°C
Aminopeptidase
(Homo sapiens (Human))
BDBM50368599
(CHEMBL1159809)
Show SMILES CS(=O)CCC(N)CS
Show InChI InChI=1S/C5H13NOS2/c1-9(7)3-2-5(6)4-8/h5,8H,2-4,6H2,1H3
NCI pathway
Reactome pathway
n/an/a 20n/an/an/an/an/an/a
Jadavpur University
Curated by ChEMBL
Assay Description
Inhibition of APN (unknown origin)
J Med Chem 61: 6468-6490 (2018)
Article DOI: 10.1021/acs.jmedchem.7b00782
BindingDB Entry DOI: 10.7270/Q28S4SHS
Aminopeptidase N
(Sus scrofa (Pig))
BDBM50368599
(CHEMBL1159809)
Show SMILES CS(=O)CCC(N)CS
Show InChI InChI=1S/C5H13NOS2/c1-9(7)3-2-5(6)4-8/h5,8H,2-4,6H2,1H3
n/an/a 20n/an/an/an/an/an/a
INSERM
Curated by ChEMBL
Assay Description
Inhibition of [3H]Leu-enkephalin binding to Aminopeptidase N from hog kidney
J Med Chem 35: 1259-66 (1992)
BindingDB Entry DOI: 10.7270/Q2125T81