BDBM50368657 CHEMBL1744114
SMILES: Fc1ccc(cc1)C1CC(N2CCN(CCN3CCCNC3=O)CC2)c2ccc(Cl)cc12
InChI Key: InChIKey=HSNXEFAUYFXJAP-UHFFFAOYSA-N
Data: 5 IC50
Activity Spreadsheet -- Enzyme Inhibition Constant Data from BindingDB
Found 5 hits for monomerid = 50368657
Trg + Lig
Ki
nM
ΔG°
kcal/mole
IC50
nM
Kd
nM
EC50/IC50
nM
koff
s-1
kon
M-1s-1
pHTemp
°C
D(2) dopamine receptor
(Rattus norvegicus (rat))
BDBM50368657
(CHEMBL1744114)
Show SMILES Fc1ccc(cc1)C1CC(N2CCN(CCN3CCCNC3=O)CC2)c2ccc(Cl)cc12
Show InChI InChI=1S/C25H30ClFN4O/c26-19-4-7-21-23(16-19)22(18-2-5-20(27)6-3-18)17-24(21)30-13-10-29(11-14-30)12-15-31-9-1-8-28-25(31)32/h2-7,16,22,24H,1,8-15,17H2,(H,28,32)
Reactome pathway
n/an/a 1.70E+3n/an/an/an/an/an/a
H. Lundbeck A/S
Curated by ChEMBL
Assay Description
Displacement of [3H]spiperone from dopamine D2 receptors in rat striatal membranes
J Med Chem 36: 2761-70 (1993)
BindingDB Entry DOI: 10.7270/Q2B858RJ
Alpha-1 Adrenergic Receptor/ adrenergic receptor/ adrenergic receptor
(Rattus norvegicus (rat)-Rattus norvegicus (Rat))
BDBM50368657
(CHEMBL1744114)
Show SMILES Fc1ccc(cc1)C1CC(N2CCN(CCN3CCCNC3=O)CC2)c2ccc(Cl)cc12
Show InChI InChI=1S/C25H30ClFN4O/c26-19-4-7-21-23(16-19)22(18-2-5-20(27)6-3-18)17-24(21)30-13-10-29(11-14-30)12-15-31-9-1-8-28-25(31)32/h2-7,16,22,24H,1,8-15,17H2,(H,28,32)
Reactome pathway
n/an/a 62n/an/an/an/an/an/a
H. Lundbeck A/S
Curated by ChEMBL
Assay Description
Displacement of [3H]prazosin from alpha-1 adrenoceptors in whole rat brain membranes
J Med Chem 36: 2761-70 (1993)
BindingDB Entry DOI: 10.7270/Q2B858RJ
Serotonin 2 (5-HT2) receptor
(Rattus norvegicus (rat)-RAT-Rattus norvegicus (Rat...)
BDBM50368657
(CHEMBL1744114)
Show SMILES Fc1ccc(cc1)C1CC(N2CCN(CCN3CCCNC3=O)CC2)c2ccc(Cl)cc12
Show InChI InChI=1S/C25H30ClFN4O/c26-19-4-7-21-23(16-19)22(18-2-5-20(27)6-3-18)17-24(21)30-13-10-29(11-14-30)12-15-31-9-1-8-28-25(31)32/h2-7,16,22,24H,1,8-15,17H2,(H,28,32)
n/an/a 1.30n/an/an/an/an/an/a
H. Lundbeck A/S
Curated by ChEMBL
Assay Description
Displacement of [3H]ketanserin from 5-hydroxytryptamine 2 receptor in rat cortical membranes
J Med Chem 36: 2761-70 (1993)
BindingDB Entry DOI: 10.7270/Q2B858RJ
Serotonin 2 (5-HT2) receptor
(Rattus norvegicus (rat)-RAT-Rattus norvegicus (Rat...)
BDBM50368657
(CHEMBL1744114)
Show SMILES Fc1ccc(cc1)C1CC(N2CCN(CCN3CCCNC3=O)CC2)c2ccc(Cl)cc12
Show InChI InChI=1S/C25H30ClFN4O/c26-19-4-7-21-23(16-19)22(18-2-5-20(27)6-3-18)17-24(21)30-13-10-29(11-14-30)12-15-31-9-1-8-28-25(31)32/h2-7,16,22,24H,1,8-15,17H2,(H,28,32)
n/an/a 120n/an/an/an/an/an/a
H. Lundbeck A/S
Curated by ChEMBL
Assay Description
Displacement of [3H]ketanserin from 5-hydroxytryptamine 2 receptor in rat cortical membranes
J Med Chem 36: 2761-70 (1993)
BindingDB Entry DOI: 10.7270/Q2B858RJ
D(2) dopamine receptor
(Rattus norvegicus (rat))
BDBM50368657
(CHEMBL1744114)
Show SMILES Fc1ccc(cc1)C1CC(N2CCN(CCN3CCCNC3=O)CC2)c2ccc(Cl)cc12
Show InChI InChI=1S/C25H30ClFN4O/c26-19-4-7-21-23(16-19)22(18-2-5-20(27)6-3-18)17-24(21)30-13-10-29(11-14-30)12-15-31-9-1-8-28-25(31)32/h2-7,16,22,24H,1,8-15,17H2,(H,28,32)
Reactome pathway
n/an/a 94n/an/an/an/an/an/a
H. Lundbeck A/S
Curated by ChEMBL
Assay Description
Displacement of [3H]spiperone from dopamine D2 receptors in rat striatal membranes
J Med Chem 36: 2761-70 (1993)
BindingDB Entry DOI: 10.7270/Q2B858RJ