BDBM50368768 CHEMBL1790908
SMILES: CC(C)C[C@H](NC(=O)[C@@H](NC(=O)[C@H](Cc1ccccc1)NC(=O)[C@H](CO)NC(C)=O)[C@H](C)O)C(=O)N[C@@H](CC(O)=O)C(=O)N[C@@H](C)C(=O)N[C@@H](CC(O)=O)C(=O)N[C@@H](Cc1ccccc1)C(O)=O
InChI Key: InChIKey=ASGLEPUSKMBIHQ-HZEDNWRWSA-N
Data: 1 IC50
Activity Spreadsheet -- Enzyme Inhibition Constant Data from BindingDB
Found 1 hit for monomerid = 50368768
Trg + Lig
Ki
nM
ΔG°
kcal/mole
IC50
nM
Kd
nM
EC50/IC50
nM
koff
s-1
kon
M-1s-1
pHTemp
°C
Ribonucleoside-diphosphate reductase M1 chain
(Mus musculus)
BDBM50368768
(CHEMBL1790908)
Show SMILES CC(C)C[C@H](NC(=O)[C@@H](NC(=O)[C@H](Cc1ccccc1)NC(=O)[C@H](CO)NC(C)=O)[C@H](C)O)C(=O)N[C@@H](CC(O)=O)C(=O)N[C@@H](C)C(=O)N[C@@H](CC(O)=O)C(=O)N[C@@H](Cc1ccccc1)C(O)=O
Show InChI InChI=1S/C44H60N8O16/c1-22(2)16-28(50-43(66)36(24(4)54)52-41(64)29(17-26-12-8-6-9-13-26)48-42(65)33(21-53)46-25(5)55)39(62)49-30(19-34(56)57)38(61)45-23(3)37(60)47-31(20-35(58)59)40(63)51-32(44(67)68)18-27-14-10-7-11-15-27/h6-15,22-24,28-33,36,53-54H,16-21H2,1-5H3,(H,45,61)(H,46,55)(H,47,60)(H,48,65)(H,49,62)(H,50,66)(H,51,63)(H,52,64)(H,56,57)(H,58,59)(H,67,68)/t23-,24-,28-,29-,30-,31-,32-,33-,36-/m0/s1
Reactome pathway
n/an/a 8.00E+3n/an/an/an/an/an/a
University of Pennsylvania
Curated by ChEMBL
Assay Description
Inhibitory activity of compound against mammalian ribonucleotide reductase; Range is 8-20
J Med Chem 36: 3859-62 (1994)
BindingDB Entry DOI: 10.7270/Q2V40VTV