BDBM50369403 CHEMBL1790995
SMILES: CC[C@@H](C)[C@H](NC(=S)NCc1ccccc1)C(=O)N[C@H](Cc1c[nH]c2ccccc12)C=O
InChI Key: InChIKey=GJLXFFKSGIYTBC-LLBVYWAGSA-N
Data: 2 IC50
Activity Spreadsheet -- Enzyme Inhibition Constant Data from BindingDB
Found 2 hits for monomerid = 50369403
Trg + Lig
Ki
nM
ΔG°
kcal/mole
IC50
nM
Kd
nM
EC50/IC50
nM
koff
s-1
kon
M-1s-1
pHTemp
°C
Procathepsin L
(Homo sapiens (Human))
BDBM50369403
(CHEMBL1790995)
Show SMILES CC[C@@H](C)[C@H](NC(=S)NCc1ccccc1)C(=O)N[C@H](Cc1c[nH]c2ccccc12)C=O
Show InChI InChI=1S/C25H30N4O2S/c1-3-17(2)23(29-25(32)27-14-18-9-5-4-6-10-18)24(31)28-20(16-30)13-19-15-26-22-12-8-7-11-21(19)22/h4-12,15-17,20,23,26H,3,13-14H2,1-2H3,(H,28,31)(H2,27,29,32)/t17-,20-,23+/m1/s1
Reactome pathway
n/an/a 2.20n/an/an/an/an/an/a
Takeda Chemical Industries, Ltd.
Curated by ChEMBL
Assay Description
Inhibition of human cathepsin L.
J Med Chem 41: 4301-8 (1998)
Article DOI: 10.1021/jm9803065
BindingDB Entry DOI: 10.7270/Q2VQ33CX
Cathepsin B
(Homo sapiens (Human))
BDBM50369403
(CHEMBL1790995)
Show SMILES CC[C@@H](C)[C@H](NC(=S)NCc1ccccc1)C(=O)N[C@H](Cc1c[nH]c2ccccc12)C=O
Show InChI InChI=1S/C25H30N4O2S/c1-3-17(2)23(29-25(32)27-14-18-9-5-4-6-10-18)24(31)28-20(16-30)13-19-15-26-22-12-8-7-11-21(19)22/h4-12,15-17,20,23,26H,3,13-14H2,1-2H3,(H,28,31)(H2,27,29,32)/t17-,20-,23+/m1/s1
Reactome pathway
n/an/a 410n/an/an/an/an/an/a
Takeda Chemical Industries, Ltd.
Curated by ChEMBL
Assay Description
Inhibition of human cathepsin B
J Med Chem 41: 4301-8 (1998)
Article DOI: 10.1021/jm9803065
BindingDB Entry DOI: 10.7270/Q2VQ33CX