BDBM50369408 CHEMBL1790997
SMILES: CC[C@@H](C)[C@H](NC(=O)Nc1cccc(C)c1)C(=O)N[C@H](Cc1c[nH]c2ccccc12)C=O
InChI Key: InChIKey=BUOGXVARMRYPBH-LLBVYWAGSA-N
Data: 2 IC50
Activity Spreadsheet -- Enzyme Inhibition Constant Data from BindingDB
Found 2 hits for monomerid = 50369408
Trg + Lig
Ki
nM
ΔG°
kcal/mole
IC50
nM
Kd
nM
EC50/IC50
nM
koff
s-1
kon
M-1s-1
pHTemp
°C
Procathepsin L
(Homo sapiens (Human))
BDBM50369408
(CHEMBL1790997)
Show SMILES CC[C@@H](C)[C@H](NC(=O)Nc1cccc(C)c1)C(=O)N[C@H](Cc1c[nH]c2ccccc12)C=O
Show InChI InChI=1S/C25H30N4O3/c1-4-17(3)23(29-25(32)28-19-9-7-8-16(2)12-19)24(31)27-20(15-30)13-18-14-26-22-11-6-5-10-21(18)22/h5-12,14-15,17,20,23,26H,4,13H2,1-3H3,(H,27,31)(H2,28,29,32)/t17-,20-,23+/m1/s1
Reactome pathway
n/an/a 3.30n/an/an/an/an/an/a
Takeda Chemical Industries, Ltd.
Curated by ChEMBL
Assay Description
Inhibition of human cathepsin L.
J Med Chem 41: 4301-8 (1998)
Article DOI: 10.1021/jm9803065
BindingDB Entry DOI: 10.7270/Q2VQ33CX
Cathepsin B
(Homo sapiens (Human))
BDBM50369408
(CHEMBL1790997)
Show SMILES CC[C@@H](C)[C@H](NC(=O)Nc1cccc(C)c1)C(=O)N[C@H](Cc1c[nH]c2ccccc12)C=O
Show InChI InChI=1S/C25H30N4O3/c1-4-17(3)23(29-25(32)28-19-9-7-8-16(2)12-19)24(31)27-20(15-30)13-18-14-26-22-11-6-5-10-21(18)22/h5-12,14-15,17,20,23,26H,4,13H2,1-3H3,(H,27,31)(H2,28,29,32)/t17-,20-,23+/m1/s1
Reactome pathway
n/an/a 270n/an/an/an/an/an/a
Takeda Chemical Industries, Ltd.
Curated by ChEMBL
Assay Description
Inhibition of human cathepsin B
J Med Chem 41: 4301-8 (1998)
Article DOI: 10.1021/jm9803065
BindingDB Entry DOI: 10.7270/Q2VQ33CX