BDBM50369454 CARBAMIC ACID
SMILES: NC(O)=O
InChI Key: InChIKey=KXDHJXZQYSOELW-UHFFFAOYSA-N
Data: 1 IC50
PDB links: 1 PDB ID matches this monomer.
Activity Spreadsheet -- Enzyme Inhibition Constant Data from BindingDB
Found 1 hit for monomerid = 50369454
Trg + Lig
Ki
nM
ΔG°
kcal/mole
IC50
nM
Kd
nM
EC50/IC50
nM
koff
s-1
kon
M-1s-1
pHTemp
°C
Acetylcholinesterase
(Homo sapiens (Human))
BDBM50369454
(CARBAMIC ACID)
Show SMILES NC(O)=O
Show InChI InChI=1S/CH3NO2/c2-1(3)4/h2H2,(H,3,4)
NCI pathway
Reactome pathway
n/an/a 6.70E+4n/an/an/an/an/an/a
Torrey Pines Institute for Molecular Studies
Curated by ChEMBL
Assay Description
Enzyme inhibitory activity towards Acetylcholinesterase
J Med Chem 42: 3743-78 (1999)
BindingDB Entry DOI: 10.7270/Q22Z167W