BDBM50369468 CHEMBL1202231
SMILES: C(N1CCNCCc2cccc(CCNCC1)n2)c1ccc(CN2CCNCCc3cccc(CCNCC2)n3)cc1
InChI Key: InChIKey=LYOIMQOXLSAORE-UHFFFAOYSA-N
Data: 1 IC50
Activity Spreadsheet -- Enzyme Inhibition Constant Data from BindingDB
Found 1 hit for monomerid = 50369468
Trg + Lig
Ki
nM
ΔG°
kcal/mole
IC50
nM
Kd
nM
EC50/IC50
nM
koff
s-1
kon
M-1s-1
pHTemp
°C
C-X-C chemokine receptor type 4 (CXCR4)
(Homo sapiens (Human))
BDBM50369468
(CHEMBL1202231)
Show SMILES C(N1CCNCCc2cccc(CCNCC1)n2)c1ccc(CN2CCNCCc3cccc(CCNCC2)n3)cc1
Show InChI InChI=1S/C34H50N8/c1-3-31-11-15-35-19-23-41(24-20-36-16-12-32(4-1)39-31)27-29-7-9-30(10-8-29)28-42-25-21-37-17-13-33-5-2-6-34(40-33)14-18-38-22-26-42/h1-10,35-38H,11-28H2
n/an/a 1n/an/an/an/an/an/a
AnorMED Inc.
Curated by ChEMBL
Assay Description
Inhibitory activity against CX3C chemokine receptor 4-specific monoclonal antibody 12G5 (mAb-12G5) binding to human chemokinin receptor CXCR4 in lymp...
J Med Chem 42: 3971-81 (1999)
BindingDB Entry DOI: 10.7270/Q2K0750M