BDBM50369533 CHEMBL611245
SMILES: CCCCCC(=O)Nc1nn(C)c2ncnc3n(cc1c23)C1O[C@H](CO)[C@@H](O)[C@H]1O
InChI Key: InChIKey=JKTLZVSPJCPSBE-FJWHWRQUSA-N
Data: 1 IC50
Activity Spreadsheet -- Enzyme Inhibition Constant Data from BindingDB
Found 1 hit for monomerid = 50369533
Trg + Lig
Ki
nM
ΔG°
kcal/mole
IC50
nM
Kd
nM
EC50/IC50
nM
koff
s-1
kon
M-1s-1
pHTemp
°C
Human immunodeficiency virus type 1 reverse transcriptase
(Human immunodeficiency virus 1)
BDBM50369533
(CHEMBL611245)
Show SMILES CCCCCC(=O)Nc1nn(C)c2ncnc3n(cc1c23)C1O[C@H](CO)[C@@H](O)[C@H]1O |r|
Show InChI InChI=1S/C19H26N6O5/c1-3-4-5-6-12(27)22-16-10-7-25(19-15(29)14(28)11(8-26)30-19)18-13(10)17(20-9-21-18)24(2)23-16/h7,9,11,14-15,19,26,28-29H,3-6,8H2,1-2H3,(H,22,23,27)/t11-,14-,15-,19?/m1/s1
n/an/a 350n/an/an/an/an/an/a
University of Michigan
Curated by ChEMBL
Assay Description
Antiviral activity was evaluated by RT (reverse transcriptase) activity in cells acutely infected with HIV-1
J Med Chem 43: 2457-63 (2000)
BindingDB Entry DOI: 10.7270/Q22N52Z2