BDBM50369535 CHEMBL607724
SMILES: CCCCCCCCC(=O)Nc1nn(C)c2ncnc3n(cc1c23)C1O[C@H](CO)[C@@H](O)[C@H]1O
InChI Key: InChIKey=JWKOMVYMSCGQMK-IJZINVNJSA-N
Data: 1 IC50
Activity Spreadsheet -- Enzyme Inhibition Constant Data from BindingDB
Found 1 hit for monomerid = 50369535
Trg + Lig
Ki
nM
ΔG°
kcal/mole
IC50
nM
Kd
nM
EC50/IC50
nM
koff
s-1
kon
M-1s-1
pHTemp
°C
Human immunodeficiency virus type 1 reverse transcriptase
(Human immunodeficiency virus 1)
BDBM50369535
(CHEMBL607724)
Show SMILES CCCCCCCCC(=O)Nc1nn(C)c2ncnc3n(cc1c23)C1O[C@H](CO)[C@@H](O)[C@H]1O |r|
Show InChI InChI=1S/C22H32N6O5/c1-3-4-5-6-7-8-9-15(30)25-19-13-10-28(22-18(32)17(31)14(11-29)33-22)21-16(13)20(23-12-24-21)27(2)26-19/h10,12,14,17-18,22,29,31-32H,3-9,11H2,1-2H3,(H,25,26,30)/t14-,17-,18-,22?/m1/s1
n/an/a 800n/an/an/an/an/an/a
University of Michigan
Curated by ChEMBL
Assay Description
Antiviral activity was evaluated by Reverse transcriptase activity in cells acutely infected with HIV-1
J Med Chem 43: 2457-63 (2000)
BindingDB Entry DOI: 10.7270/Q22N52Z2