BDBM50369930 CHEMBL609776
SMILES: NCCCCCCCCNC(=O)[C@H]1OC([C@H](O)[C@@H]1O)n1cnc2c(N)ncnc12
InChI Key: InChIKey=OOPDCKNKYVGROT-CDJKEZFESA-N
Data: 1 KI
Activity Spreadsheet -- Enzyme Inhibition Constant Data from BindingDB
Found 1 hit for monomerid = 50369930
Trg + Lig
Ki
nM
ΔG°
kcal/mole
IC50
nM
Kd
nM
EC50/IC50
nM
koff
s-1
kon
M-1s-1
pHTemp
°C
G protein-coupled receptor 80
(Rattus norvegicus)
BDBM50369930
(CHEMBL609776)
Show SMILES NCCCCCCCCNC(=O)[C@H]1OC([C@H](O)[C@@H]1O)n1cnc2c(N)ncnc12 |r|
Show InChI InChI=1S/C18H29N7O4/c19-7-5-3-1-2-4-6-8-21-17(28)14-12(26)13(27)18(29-14)25-10-24-11-15(20)22-9-23-16(11)25/h9-10,12-14,18,26-27H,1-8,19H2,(H,21,28)(H2,20,22,23)/t12-,13+,14-,18?/m0/s1
Reactome pathway
29n/an/an/an/an/an/an/an/a
Hokkaido University
Curated by ChEMBL
Assay Description
Binding activity of P3 purinoceptor-like protein (P3LP) using radioligand 40 nM [3H]NECA from rat brain membranes
J Med Chem 44: 208-14 (2001)
BindingDB Entry DOI: 10.7270/Q2H41S5S