BDBM50369937 CHEMBL608293
SMILES: CC(C)CONC(=O)[C@H]1OC([C@H](O)[C@@H]1O)n1cnc2c(N)ncnc12
InChI Key: InChIKey=GCWNBWOAXTZZMS-JDSSLJPYSA-N
Data: 1 KI
Activity Spreadsheet -- Enzyme Inhibition Constant Data from BindingDB
Found 1 hit for monomerid = 50369937
Trg + Lig
Ki
nM
ΔG°
kcal/mole
IC50
nM
Kd
nM
EC50/IC50
nM
koff
s-1
kon
M-1s-1
pHTemp
°C
G protein-coupled receptor 80
(Rattus norvegicus)
BDBM50369937
(CHEMBL608293)
Show SMILES CC(C)CONC(=O)[C@H]1OC([C@H](O)[C@@H]1O)n1cnc2c(N)ncnc12 |r|
Show InChI InChI=1S/C14H20N6O5/c1-6(2)3-24-19-13(23)10-8(21)9(22)14(25-10)20-5-18-7-11(15)16-4-17-12(7)20/h4-6,8-10,14,21-22H,3H2,1-2H3,(H,19,23)(H2,15,16,17)/t8-,9+,10-,14?/m0/s1
Reactome pathway
20n/an/an/an/an/an/an/an/a
Hokkaido University
Curated by ChEMBL
Assay Description
Binding activity of P3 purinoceptor-like protein (P3LP) using radioligand 40 nM [3H]NECA from rat brain membranes
J Med Chem 44: 208-14 (2001)
BindingDB Entry DOI: 10.7270/Q2H41S5S