BDBM50369945 CHEMBL609775
SMILES: CC(=O)NCCNC(=O)[C@H]1OC([C@H](O)[C@@H]1O)n1cnc2c(N)ncnc12
InChI Key: InChIKey=GGOVCSJSAPZKEW-JDSSLJPYSA-N
Data: 1 KI
Activity Spreadsheet -- Enzyme Inhibition Constant Data from BindingDB
Found 1 hit for monomerid = 50369945
Trg + Lig
Ki
nM
ΔG°
kcal/mole
IC50
nM
Kd
nM
EC50/IC50
nM
koff
s-1
kon
M-1s-1
pHTemp
°C
G protein-coupled receptor 80
(Rattus norvegicus)
BDBM50369945
(CHEMBL609775)
Show SMILES CC(=O)NCCNC(=O)[C@H]1OC([C@H](O)[C@@H]1O)n1cnc2c(N)ncnc12 |r|
Show InChI InChI=1S/C14H19N7O5/c1-6(22)16-2-3-17-13(25)10-8(23)9(24)14(26-10)21-5-20-7-11(15)18-4-19-12(7)21/h4-5,8-10,14,23-24H,2-3H2,1H3,(H,16,22)(H,17,25)(H2,15,18,19)/t8-,9+,10-,14?/m0/s1
Reactome pathway
46n/an/an/an/an/an/an/an/a
Hokkaido University
Curated by ChEMBL
Assay Description
Binding activity of P3 purinoceptor-like protein (P3LP) using radioligand 40 nM [3H]NECA from rat brain membranes
J Med Chem 44: 208-14 (2001)
BindingDB Entry DOI: 10.7270/Q2H41S5S