BDBM50370214 CHEMBL1788318
SMILES: CCCN1c2ccccc2C(=N[C@H](NC(=O)Nc2ccc(cc2)N2CCC(CC2)N2CCCCC2)C1=O)C1CCCCC1
InChI Key: InChIKey=BGQKMAPKUALMFZ-MGBGTMOVSA-N
Data: 1 KI  1 IC50
Activity Spreadsheet -- Enzyme Inhibition Constant Data from BindingDB
Found 2 hits for monomerid = 50370214
Trg + Lig
Ki
nM
ΔG°
kcal/mole
IC50
nM
Kd
nM
EC50/IC50
nM
koff
s-1
kon
M-1s-1
pHTemp
°C
Bradykinin B1 receptor
(Homo sapiens (Human))
BDBM50370214
(CHEMBL1788318)
Show SMILES CCCN1c2ccccc2C(=N[C@H](NC(=O)Nc2ccc(cc2)N2CCC(CC2)N2CCCCC2)C1=O)C1CCCCC1 |r,c:11|
Show InChI InChI=1S/C35H48N6O2/c1-2-21-41-31-14-8-7-13-30(31)32(26-11-5-3-6-12-26)37-33(34(41)42)38-35(43)36-27-15-17-28(18-16-27)40-24-19-29(20-25-40)39-22-9-4-10-23-39/h7-8,13-18,26,29,33H,2-6,9-12,19-25H2,1H3,(H2,36,38,43)/t33-/m1/s1
1.02E+3n/an/an/an/an/an/an/an/a
Merck Research Laboratories
Curated by ChEMBL
Assay Description
Inhibition of human bradykinin B1 receptor
J Med Chem 46: 1803-6 (2003)
Article DOI: 10.1021/jm034020y
BindingDB Entry DOI: 10.7270/Q29P32C6
Bradykinin B1 receptor
(Homo sapiens (Human))
BDBM50370214
(CHEMBL1788318)
Show SMILES CCCN1c2ccccc2C(=N[C@H](NC(=O)Nc2ccc(cc2)N2CCC(CC2)N2CCCCC2)C1=O)C1CCCCC1 |r,c:11|
Show InChI InChI=1S/C35H48N6O2/c1-2-21-41-31-14-8-7-13-30(31)32(26-11-5-3-6-12-26)37-33(34(41)42)38-35(43)36-27-15-17-28(18-16-27)40-24-19-29(20-25-40)39-22-9-4-10-23-39/h7-8,13-18,26,29,33H,2-6,9-12,19-25H2,1H3,(H2,36,38,43)/t33-/m1/s1
n/an/a 2.20E+3n/an/an/an/an/an/a
Merck Research Laboratories
Curated by ChEMBL
Assay Description
Compound was tested for inhibition against human bradykinin B1 receptor using FLIPR assay
J Med Chem 46: 1803-6 (2003)
Article DOI: 10.1021/jm034020y
BindingDB Entry DOI: 10.7270/Q29P32C6