null
SMILES: Fc1cc(cnc1F)-c1ccc2OCCCCn3cnnc3-c3cccc(NC(=O)c2c1)n3
InChI Key:
Activity Spreadsheet -- Enzyme Inhibition Constant Data from BindingDB
Found 1 hit for monomerid = 503704
Trg + Lig
Ki
nM
ΔG°
kcal/mole
IC50
nM
Kd
nM
EC50/IC50
nM
koff
s-1
kon
M-1s-1
pHTemp
°C
Mitogen-activated protein kinase kinase kinase 5
(Homo sapiens (Human))
BDBM503704
(US11034671, Example 98)
Show SMILES Fc1cc(cnc1F)-c1ccc2OCCCCn3cnnc3-c3cccc(NC(=O)c2c1)n3
n/an/an/a<100n/an/an/an/an/a
TBA
Citation and Details
BindingDB Entry DOI: 10.7270/Q2S185M8