BDBM50370607 CHEMBL609093
SMILES: CC(C)[C@@H](N)C(=O)OC[C@H]1OC([C@H](O)[C@@H]1O)n1c(Br)nc2cc(Cl)c(Cl)cc12
InChI Key: InChIKey=SOUOYGLAJHYXES-AVBXVCIKSA-N
Data: 1 IC50
Activity Spreadsheet -- Enzyme Inhibition Constant Data from BindingDB
Found 1 hit for monomerid = 50370607
Trg + Lig
Ki
nM
ΔG°
kcal/mole
IC50
nM
Kd
nM
EC50/IC50
nM
koff
s-1
kon
M-1s-1
pHTemp
°C
Oligopeptide transporter small intestine isoform
(Homo sapiens (Human))
BDBM50370607
(CHEMBL609093)
Show SMILES CC(C)[C@@H](N)C(=O)OC[C@H]1OC([C@H](O)[C@@H]1O)n1c(Br)nc2cc(Cl)c(Cl)cc12 |r|
Show InChI InChI=1S/C17H20BrCl2N3O5/c1-6(2)12(21)16(26)27-5-11-13(24)14(25)15(28-11)23-10-4-8(20)7(19)3-9(10)22-17(23)18/h3-4,6,11-15,24-25H,5,21H2,1-2H3/t11-,12-,13-,14-,15?/m1/s1
Reactome pathway
n/an/a 3.42E+5n/an/an/an/an/an/a
University of Michigan
Curated by ChEMBL
Assay Description
Inhibitory concentration against [3H]glycylsarcosine uptake in HeLa cells expressing human Intestinal peptide transporter PepT1
J Med Chem 48: 1274-7 (2005)
Article DOI: 10.1021/jm049450i
BindingDB Entry DOI: 10.7270/Q2348M46