BDBM50370716 CHEMBL1081157
SMILES: CC1(C)CC[C@]2(C)CC[C@]3(C(O)=O)C(=CC[C@@H]4[C@@]5(C)CCC(=O)C(C)(C)[C@@H]5CC[C@@]34C)[C@@H]2C1
InChI Key: InChIKey=DQHMTWAVBRLUSK-FLYBRSFCSA-N
Data: 1 IC50
Activity Spreadsheet -- Enzyme Inhibition Constant Data from BindingDB
Found 1 hit for monomerid = 50370716
Trg + Lig
Ki
nM
ΔG°
kcal/mole
IC50
nM
Kd
nM
EC50/IC50
nM
koff
s-1
kon
M-1s-1
pHTemp
°C
Protein-tyrosine phosphatase 1B
(Homo sapiens (Human))
BDBM50370716
(CHEMBL1081157)
Show SMILES CC1(C)CC[C@]2(C)CC[C@]3(C(O)=O)C(=CC[C@@H]4[C@@]5(C)CCC(=O)C(C)(C)[C@@H]5CC[C@@]34C)[C@@H]2C1 |r,c:13|
Show InChI InChI=1S/C30H46O3/c1-25(2)14-15-27(5)16-17-30(24(32)33)19(20(27)18-25)8-9-22-28(6)12-11-23(31)26(3,4)21(28)10-13-29(22,30)7/h8,20-22H,9-18H2,1-7H3,(H,32,33)/t20-,21-,22+,27+,28-,29+,30+/m0/s1
NCI pathway
Reactome pathway
n/an/a 6.80E+3n/an/an/an/an/an/a
Korea Research Institute of Bioscience and Biotechnology
Curated by ChEMBL
Assay Description
Inhibition of human recombinant PTP1B
Bioorg Med Chem Lett 16: 3273-6 (2006)
Article DOI: 10.1016/j.bmcl.2006.03.036
BindingDB Entry DOI: 10.7270/Q2ZP46WV