BDBM50370868 CHEMBL218485
SMILES: Cc1ccc2nc(sc2c1)-c1ccc(NC(=O)c2ccc(Cl)cc2)cc1
InChI Key: InChIKey=YHORBRLHLYGKSE-UHFFFAOYSA-N
Data: 1 IC50
Activity Spreadsheet -- Enzyme Inhibition Constant Data from BindingDB
Found 1 hit for monomerid = 50370868
Trg + Lig
Ki
nM
ΔG°
kcal/mole
IC50
nM
Kd
nM
EC50/IC50
nM
koff
s-1
kon
M-1s-1
pHTemp
°C
Cystathionine beta-lyase metC
(Escherichia coli K-12)
BDBM50370868
(CHEMBL218485)
Show SMILES Cc1ccc2nc(sc2c1)-c1ccc(NC(=O)c2ccc(Cl)cc2)cc1
Show InChI InChI=1S/C21H15ClN2OS/c1-13-2-11-18-19(12-13)26-21(24-18)15-5-9-17(10-6-15)23-20(25)14-3-7-16(22)8-4-14/h2-12H,1H3,(H,23,25)
n/an/a 2.00E+5n/an/an/an/an/an/a
McMaster University
Curated by ChEMBL
Assay Description
Inhibition of Escherichia coli CBL
J Med Chem 50: 755-64 (2007)
Article DOI: 10.1021/jm061132r
BindingDB Entry DOI: 10.7270/Q2KS6SCJ