BDBM50371238 CHEMBL269764
SMILES: Clc1ccc(cc1)-c1ccc(o1)C(=O)Nc1ccc2ncccc2c1
InChI Key: InChIKey=MGDBZNLDOYTHOG-UHFFFAOYSA-N
Data: 1 IC50
Activity Spreadsheet -- Enzyme Inhibition Constant Data from BindingDB
Found 1 hit for monomerid = 50371238
Trg + Lig
Ki
nM
ΔG°
kcal/mole
IC50
nM
Kd
nM
EC50/IC50
nM
koff
s-1
kon
M-1s-1
pHTemp
°C
Sodium channel protein type X alpha subunit
(Mus musculus)
BDBM50371238
(CHEMBL269764)
Show SMILES Clc1ccc(cc1)-c1ccc(o1)C(=O)Nc1ccc2ncccc2c1
Show InChI InChI=1S/C20H13ClN2O2/c21-15-5-3-13(4-6-15)18-9-10-19(25-18)20(24)23-16-7-8-17-14(12-16)2-1-11-22-17/h1-12H,(H,23,24)
n/an/a 1.00E+4n/an/an/an/an/an/a
Abbott Laboratories
Curated by ChEMBL
Assay Description
Inhibition of mouse recombinant Nav 1.8 channel expressed in HEK293 cells by isotopic efflux assay
J Med Chem 51: 407-16 (2008)
Article DOI: 10.1021/jm070637u
BindingDB Entry DOI: 10.7270/Q2KK9CN7