BDBM50371245 CHEMBL399792
SMILES: CN1CCOc2cc(NC(=O)c3ccc(o3)-c3ccc(Cl)cc3)ccc12
InChI Key: InChIKey=QNZPSPBILYUMMU-UHFFFAOYSA-N
Data: 1 IC50
Activity Spreadsheet -- Enzyme Inhibition Constant Data from BindingDB
Found 1 hit for monomerid = 50371245
Trg + Lig
Ki
nM
ΔG°
kcal/mole
IC50
nM
Kd
nM
EC50/IC50
nM
koff
s-1
kon
M-1s-1
pHTemp
°C
Sodium channel protein type X alpha subunit
(Mus musculus)
BDBM50371245
(CHEMBL399792)
Show SMILES CN1CCOc2cc(NC(=O)c3ccc(o3)-c3ccc(Cl)cc3)ccc12
Show InChI InChI=1S/C20H17ClN2O3/c1-23-10-11-25-19-12-15(6-7-16(19)23)22-20(24)18-9-8-17(26-18)13-2-4-14(21)5-3-13/h2-9,12H,10-11H2,1H3,(H,22,24)
n/an/a 970n/an/an/an/an/an/a
Abbott Laboratories
Curated by ChEMBL
Assay Description
Inhibition of mouse recombinant Nav 1.8 channel expressed in HEK293 cells by isotopic efflux assay
J Med Chem 51: 407-16 (2008)
Article DOI: 10.1021/jm070637u
BindingDB Entry DOI: 10.7270/Q2KK9CN7