BDBM50371249 CHEMBL250698
SMILES: Clc1ccc(cc1)-c1ccc(o1)C(=O)Nc1cccc(c1)C1=NCCO1
InChI Key: InChIKey=HYGDVQUWLNEKQY-UHFFFAOYSA-N
Data: 1 IC50
Activity Spreadsheet -- Enzyme Inhibition Constant Data from BindingDB
Found 1 hit for monomerid = 50371249
Trg + Lig
Ki
nM
ΔG°
kcal/mole
IC50
nM
Kd
nM
EC50/IC50
nM
koff
s-1
kon
M-1s-1
pHTemp
°C
Sodium channel protein type X alpha subunit
(Mus musculus)
BDBM50371249
(CHEMBL250698)
Show SMILES Clc1ccc(cc1)-c1ccc(o1)C(=O)Nc1cccc(c1)C1=NCCO1 |t:24|
Show InChI InChI=1S/C20H15ClN2O3/c21-15-6-4-13(5-7-15)17-8-9-18(26-17)19(24)23-16-3-1-2-14(12-16)20-22-10-11-25-20/h1-9,12H,10-11H2,(H,23,24)
n/an/a 2.50E+3n/an/an/an/an/an/a
Abbott Laboratories
Curated by ChEMBL
Assay Description
Inhibition of mouse recombinant Nav 1.8 channel expressed in HEK293 cells by isotopic efflux assay
J Med Chem 51: 407-16 (2008)
Article DOI: 10.1021/jm070637u
BindingDB Entry DOI: 10.7270/Q2KK9CN7