BDBM50371378 CHEMBL259899
SMILES: CN(C)C(c1ccccc1)(c1ccccc1)c1ccccc1
InChI Key: InChIKey=CJTMNDMKZBYLNA-UHFFFAOYSA-N
Data: 1 IC50
Activity Spreadsheet -- Enzyme Inhibition Constant Data from BindingDB
Found 1 hit for monomerid = 50371378
Trg + Lig
Ki
nM
ΔG°
kcal/mole
IC50
nM
Kd
nM
EC50/IC50
nM
koff
s-1
kon
M-1s-1
pHTemp
°C
Intermediate conductance calcium-activated potassium channel protein 4
(Homo sapiens (Human))
BDBM50371378
(CHEMBL259899)
Show SMILES CN(C)C(c1ccccc1)(c1ccccc1)c1ccccc1
Show InChI InChI=1S/C21H21N/c1-22(2)21(18-12-6-3-7-13-18,19-14-8-4-9-15-19)20-16-10-5-11-17-20/h3-17H,1-2H3
Reactome pathway
n/an/a 3.15E+3n/an/an/an/an/an/a
Icagen, Inc.
Curated by ChEMBL
Assay Description
Inhibition of Gardos channel in human RBC assessed as inhibition of ionomycin-stimulated [86Rb] efflux
J Med Chem 51: 976-82 (2008)
Article DOI: 10.1021/jm070663s
BindingDB Entry DOI: 10.7270/Q23F4QGH