BDBM50371576 CHEMBL1162164
SMILES: OP(O)(=O)OC[C@H]1O[C@H]([C@@H]2OC(O[C@H]12)C#Cc1ccccc1)n1cnc2c(NC(=O)Nc3ccccc3)ncnc12
InChI Key: InChIKey=MPBHAGPNVWBUTJ-RBTCWQMQSA-N
Data: 1 IC50
Activity Spreadsheet -- Enzyme Inhibition Constant Data from BindingDB
Found 1 hit for monomerid = 50371576
Trg + Lig
Ki
nM
ΔG°
kcal/mole
IC50
nM
Kd
nM
EC50/IC50
nM
koff
s-1
kon
M-1s-1
pHTemp
°C
Purinergic receptor P2Y12
(Homo sapiens (Human))
BDBM50371576
(CHEMBL1162164)
Show SMILES OP(O)(=O)OC[C@H]1O[C@H]([C@@H]2OC(O[C@H]12)C#Cc1ccccc1)n1cnc2c(NC(=O)Nc3ccccc3)ncnc12 |r|
Show InChI InChI=1S/C26H23N6O8P/c33-26(30-17-9-5-2-6-10-17)31-23-20-24(28-14-27-23)32(15-29-20)25-22-21(18(38-25)13-37-41(34,35)36)39-19(40-22)12-11-16-7-3-1-4-8-16/h1-10,14-15,18-19,21-22,25H,13H2,(H2,34,35,36)(H2,27,28,30,31,33)/t18-,19?,21-,22-,25-/m1/s1
Reactome pathway
n/an/a 288n/an/an/an/an/an/a
Inspire Pharmaceuticals, Inc.
Curated by ChEMBL
Assay Description
Antagonist activity at P2Y12 receptor assessed as inhibition of ADP-induced human platelet aggregation by washed platelet assay
J Med Chem 51: 1007-25 (2008)
Article DOI: 10.1021/jm701348d
BindingDB Entry DOI: 10.7270/Q2P55PB6