BDBM50371614 CHEMBL269836
SMILES: CC(C)c1cc(C(=O)c2ccccc2)c(O)c(O)c1O
InChI Key: InChIKey=DZEBXWALUCQUJM-UHFFFAOYSA-N
Data: 2 KI  2 IC50
Activity Spreadsheet -- Enzyme Inhibition Constant Data from BindingDB
Found 4 hits for monomerid = 50371614
Trg + Lig
Ki
nM
ΔG°
kcal/mole
IC50
nM
Kd
nM
EC50/IC50
nM
koff
s-1
kon
M-1s-1
pHTemp
°C
Induced myeloid leukemia cell differentiation protein Mcl-1
(Homo sapiens (Human))
BDBM50371614
(CHEMBL269836)
Show SMILES CC(C)c1cc(C(=O)c2ccccc2)c(O)c(O)c1O
Show InChI InChI=1S/C16H16O4/c1-9(2)11-8-12(15(19)16(20)14(11)18)13(17)10-6-4-3-5-7-10/h3-9,18-20H,1-2H3
NCI pathway
4.60E+3n/an/an/an/an/an/an/an/a
TBA
Curated by ChEMBL
Assay Description
Inhibition of human Mcl-1 protein by fluorescence polarization assay
J Med Chem 51: 717-20 (2008)
Article DOI: 10.1021/jm701358v
BindingDB Entry DOI: 10.7270/Q2JD4XNX
Induced myeloid leukemia cell differentiation protein Mcl-1
(Homo sapiens (Human))
BDBM50371614
(CHEMBL269836)
Show SMILES CC(C)c1cc(C(=O)c2ccccc2)c(O)c(O)c1O
Show InChI InChI=1S/C16H16O4/c1-9(2)11-8-12(15(19)16(20)14(11)18)13(17)10-6-4-3-5-7-10/h3-9,18-20H,1-2H3
NCI pathway
4.60E+3n/an/an/an/an/an/an/an/a
Dalian University of Technology
Curated by ChEMBL
Assay Description
Binding affinity to Mcl-1 (unknown origin) by fluorescence polarization assay
Eur J Med Chem 59: 141-9 (2013)
Article DOI: 10.1016/j.ejmech.2012.10.050
BindingDB Entry DOI: 10.7270/Q25B03V2
Apoptosis regulator Bcl-2
(Homo sapiens (Human))
BDBM50371614
(CHEMBL269836)
Show SMILES CC(C)c1cc(C(=O)c2ccccc2)c(O)c(O)c1O
Show InChI InChI=1S/C16H16O4/c1-9(2)11-8-12(15(19)16(20)14(11)18)13(17)10-6-4-3-5-7-10/h3-9,18-20H,1-2H3
n/an/a 4.16E+4n/an/an/an/an/an/a
TBA
Curated by ChEMBL
Assay Description
Inhibition of human Bcl-2 protein by ELISA
J Med Chem 51: 717-20 (2008)
Article DOI: 10.1021/jm701358v
BindingDB Entry DOI: 10.7270/Q2JD4XNX
Induced myeloid leukemia cell differentiation protein Mcl-1
(Homo sapiens (Human))
BDBM50371614
(CHEMBL269836)
Show SMILES CC(C)c1cc(C(=O)c2ccccc2)c(O)c(O)c1O
Show InChI InChI=1S/C16H16O4/c1-9(2)11-8-12(15(19)16(20)14(11)18)13(17)10-6-4-3-5-7-10/h3-9,18-20H,1-2H3
NCI pathway
n/an/a 3.65E+4n/an/an/an/an/an/a
TBA
Curated by ChEMBL
Assay Description
Inhibition of human Mcl-1 protein by fluorescence polarization assay
J Med Chem 51: 717-20 (2008)
Article DOI: 10.1021/jm701358v
BindingDB Entry DOI: 10.7270/Q2JD4XNX