BDBM50371869 CHEMBL270151
SMILES: CO[C@@H]1CN(C[C@H]2Cc3ccc(NC(=O)OC)cc3C2)CC[C@H]1n1c(C)nc2cc(C)ccc12
InChI Key: InChIKey=KBHALIJUSMYPCR-AFWDCEBSSA-N
Data: 1 KI  1 EC50
Activity Spreadsheet -- Enzyme Inhibition Constant Data from BindingDB
Found 2 hits for monomerid = 50371869
Trg + Lig
Ki
nM
ΔG°
kcal/mole
IC50
nM
Kd
nM
EC50/IC50
nM
koff
s-1
kon
M-1s-1
pHTemp
°C
Melanin-concentrating hormone receptor
(Homo sapiens (Human))
BDBM50371869
(CHEMBL270151)
Show SMILES CO[C@@H]1CN(C[C@H]2Cc3ccc(NC(=O)OC)cc3C2)CC[C@H]1n1c(C)nc2cc(C)ccc12
Show InChI InChI=1S/C27H34N4O3/c1-17-5-8-24-23(11-17)28-18(2)31(24)25-9-10-30(16-26(25)33-3)15-19-12-20-6-7-22(14-21(20)13-19)29-27(32)34-4/h5-8,11,14,19,25-26H,9-10,12-13,15-16H2,1-4H3,(H,29,32)/t19-,25+,26+/m0/s1
Reactome pathway
20n/an/an/an/an/an/an/an/a
Hoffmann-La Roche, Inc.
Curated by ChEMBL
Assay Description
Binding affinity to MCHR1
Bioorg Med Chem Lett 18: 1402-6 (2008)
Article DOI: 10.1016/j.bmcl.2008.01.010
BindingDB Entry DOI: 10.7270/Q2M909HR
Melanin-concentrating hormone receptor
(Homo sapiens (Human))
BDBM50371869
(CHEMBL270151)
Show SMILES CO[C@@H]1CN(C[C@H]2Cc3ccc(NC(=O)OC)cc3C2)CC[C@H]1n1c(C)nc2cc(C)ccc12
Show InChI InChI=1S/C27H34N4O3/c1-17-5-8-24-23(11-17)28-18(2)31(24)25-9-10-30(16-26(25)33-3)15-19-12-20-6-7-22(14-21(20)13-19)29-27(32)34-4/h5-8,11,14,19,25-26H,9-10,12-13,15-16H2,1-4H3,(H,29,32)/t19-,25+,26+/m0/s1
Reactome pathway
n/an/an/an/a 20n/an/an/an/a
Hoffmann-La Roche, Inc.
Curated by ChEMBL
Assay Description
Antagonist activity at MCHR1 by cAMP assay
Bioorg Med Chem Lett 18: 1402-6 (2008)
Article DOI: 10.1016/j.bmcl.2008.01.010
BindingDB Entry DOI: 10.7270/Q2M909HR