BDBM50371872 CHEMBL257280
SMILES: CO[C@@H]1CN(C[C@H]2Cc3ccc(cc3C2)C#N)CC[C@H]1n1c(nc2cc(C)ccc12)C(C)(C)O
InChI Key: InChIKey=DDPFMTCKLODLQM-GKBBYZSKSA-N
Data: 1 KI  1 EC50
Activity Spreadsheet -- Enzyme Inhibition Constant Data from BindingDB
Found 2 hits for monomerid = 50371872
Trg + Lig
Ki
nM
ΔG°
kcal/mole
IC50
nM
Kd
nM
EC50/IC50
nM
koff
s-1
kon
M-1s-1
pHTemp
°C
Melanin-concentrating hormone receptor
(Homo sapiens (Human))
BDBM50371872
(CHEMBL257280)
Show SMILES CO[C@@H]1CN(C[C@H]2Cc3ccc(cc3C2)C#N)CC[C@H]1n1c(nc2cc(C)ccc12)C(C)(C)O
Show InChI InChI=1S/C28H34N4O2/c1-18-5-8-24-23(11-18)30-27(28(2,3)33)32(24)25-9-10-31(17-26(25)34-4)16-20-13-21-7-6-19(15-29)12-22(21)14-20/h5-8,11-12,20,25-26,33H,9-10,13-14,16-17H2,1-4H3/t20-,25+,26+/m0/s1
Reactome pathway
3n/an/an/an/an/an/an/an/a
Hoffmann-La Roche, Inc.
Curated by ChEMBL
Assay Description
Binding affinity to MCHR1
Bioorg Med Chem Lett 18: 1402-6 (2008)
Article DOI: 10.1016/j.bmcl.2008.01.010
BindingDB Entry DOI: 10.7270/Q2M909HR
Melanin-concentrating hormone receptor
(Homo sapiens (Human))
BDBM50371872
(CHEMBL257280)
Show SMILES CO[C@@H]1CN(C[C@H]2Cc3ccc(cc3C2)C#N)CC[C@H]1n1c(nc2cc(C)ccc12)C(C)(C)O
Show InChI InChI=1S/C28H34N4O2/c1-18-5-8-24-23(11-18)30-27(28(2,3)33)32(24)25-9-10-31(17-26(25)34-4)16-20-13-21-7-6-19(15-29)12-22(21)14-20/h5-8,11-12,20,25-26,33H,9-10,13-14,16-17H2,1-4H3/t20-,25+,26+/m0/s1
Reactome pathway
n/an/an/an/a 17n/an/an/an/a
Hoffmann-La Roche, Inc.
Curated by ChEMBL
Assay Description
Antagonist activity at MCHR1 by cAMP assay
Bioorg Med Chem Lett 18: 1402-6 (2008)
Article DOI: 10.1016/j.bmcl.2008.01.010
BindingDB Entry DOI: 10.7270/Q2M909HR