BDBM50371932 CHEMBL271523
SMILES: Cc1cc(on1)-c1c(-c2ccccc2)c2cc(N)ccc2[nH]c1=O
InChI Key: InChIKey=WIMKRMBHQDXTAH-UHFFFAOYSA-N
Data: 1 IC50
Activity Spreadsheet -- Enzyme Inhibition Constant Data from BindingDB
Found 1 hit for monomerid = 50371932
Trg + Lig
Ki
nM
ΔG°
kcal/mole
IC50
nM
Kd
nM
EC50/IC50
nM
koff
s-1
kon
M-1s-1
pHTemp
°C
Macrophage colony stimulating factor receptor
(Homo sapiens (Human))
BDBM50371932
(CHEMBL271523)
Show SMILES Cc1cc(on1)-c1c(-c2ccccc2)c2cc(N)ccc2[nH]c1=O
Show InChI InChI=1S/C19H15N3O2/c1-11-9-16(24-22-11)18-17(12-5-3-2-4-6-12)14-10-13(20)7-8-15(14)21-19(18)23/h2-10H,20H2,1H3,(H,21,23)
n/an/a>5.00E+3n/an/an/an/an/an/a
Johnson& Johnson Pharmaceutical Research& Development
Curated by ChEMBL
Assay Description
Inhibition of human cytoplasmic macrophage colony-stimulating factor 1 receptor by fluorescence polarization
Bioorg Med Chem Lett 18: 2097-102 (2008)
Article DOI: 10.1016/j.bmcl.2008.01.088
BindingDB Entry DOI: 10.7270/Q23779JH