BDBM50371936 CHEMBL270464
SMILES: COc1ccc(cc1)-c1c(-c2cc(C)no2)c(=O)[nH]c2ccc(Cl)cc12
InChI Key: InChIKey=OFJXRMIYGCVLOK-UHFFFAOYSA-N
Data: 1 IC50
Activity Spreadsheet -- Enzyme Inhibition Constant Data from BindingDB
Found 1 hit for monomerid = 50371936
Trg + Lig
Ki
nM
ΔG°
kcal/mole
IC50
nM
Kd
nM
EC50/IC50
nM
koff
s-1
kon
M-1s-1
pHTemp
°C
Macrophage colony stimulating factor receptor
(Homo sapiens (Human))
BDBM50371936
(CHEMBL270464)
Show SMILES COc1ccc(cc1)-c1c(-c2cc(C)no2)c(=O)[nH]c2ccc(Cl)cc12
Show InChI InChI=1S/C20H15ClN2O3/c1-11-9-17(26-23-11)19-18(12-3-6-14(25-2)7-4-12)15-10-13(21)5-8-16(15)22-20(19)24/h3-10H,1-2H3,(H,22,24)
n/an/a 140n/an/an/an/an/an/a
Johnson& Johnson Pharmaceutical Research& Development
Curated by ChEMBL
Assay Description
Inhibition of human cytoplasmic macrophage colony-stimulating factor 1 receptor by fluorescence polarization
Bioorg Med Chem Lett 18: 2097-102 (2008)
Article DOI: 10.1016/j.bmcl.2008.01.088
BindingDB Entry DOI: 10.7270/Q23779JH