BDBM50372103 CHEMBL402807
SMILES: Oc1c2C3CCC(O3)c2c(O)n1-c1ccc([N+]([O-])=O)c2ccccc12
InChI Key: InChIKey=MQRBVUDXEAGBPG-UHFFFAOYSA-N
Data: 1 KI  1 IC50
Activity Spreadsheet -- Enzyme Inhibition Constant Data from BindingDB
Found 2 hits for monomerid = 50372103
Trg + Lig
Ki
nM
ΔG°
kcal/mole
IC50
nM
Kd
nM
EC50/IC50
nM
koff
s-1
kon
M-1s-1
pHTemp
°C
Androgen receptor
(Homo sapiens (Human))
BDBM50372103
(CHEMBL402807)
Show SMILES Oc1c2C3CCC(O3)c2c(O)n1-c1ccc([N+]([O-])=O)c2ccccc12 |THB:9:8:7:5.4,1:2:7:5.4,(7.88,-13.23,;8.78,-12.29,;10.06,-12.46,;11.36,-11.72,;12.65,-12.28,;13.1,-11.18,;11.68,-10.45,;11.33,-9.07,;10.63,-11.29,;9.69,-10.39,;9.71,-9.09,;8.54,-11.01,;6.99,-10.97,;6.18,-12.3,;4.63,-12.26,;3.89,-10.89,;2.34,-10.85,;1.6,-9.49,;1.53,-12.17,;4.7,-9.57,;3.96,-8.22,;4.76,-6.91,;6.31,-6.94,;7.04,-8.3,;6.24,-9.61,)|
Show InChI InChI=1S/C18H14N2O5/c21-17-15-13-7-8-14(25-13)16(15)18(22)19(17)11-5-6-12(20(23)24)10-4-2-1-3-9(10)11/h1-6,13-14,21-22H,7-8H2
NCI pathway
Reactome pathway
3n/an/an/an/an/an/an/an/a
Bristol-Myers Squibb Pharmaceutical Research and Development
Curated by ChEMBL
Assay Description
Displacement of [3H]DHT from human androgen receptor in MDA453 cells
Bioorg Med Chem Lett 18: 1910-5 (2008)
Article DOI: 10.1016/j.bmcl.2008.02.006
BindingDB Entry DOI: 10.7270/Q2DJ5GGT
Androgen receptor
(Homo sapiens (Human))
BDBM50372103
(CHEMBL402807)
Show SMILES Oc1c2C3CCC(O3)c2c(O)n1-c1ccc([N+]([O-])=O)c2ccccc12 |THB:9:8:7:5.4,1:2:7:5.4,(7.88,-13.23,;8.78,-12.29,;10.06,-12.46,;11.36,-11.72,;12.65,-12.28,;13.1,-11.18,;11.68,-10.45,;11.33,-9.07,;10.63,-11.29,;9.69,-10.39,;9.71,-9.09,;8.54,-11.01,;6.99,-10.97,;6.18,-12.3,;4.63,-12.26,;3.89,-10.89,;2.34,-10.85,;1.6,-9.49,;1.53,-12.17,;4.7,-9.57,;3.96,-8.22,;4.76,-6.91,;6.31,-6.94,;7.04,-8.3,;6.24,-9.61,)|
Show InChI InChI=1S/C18H14N2O5/c21-17-15-13-7-8-14(25-13)16(15)18(22)19(17)11-5-6-12(20(23)24)10-4-2-1-3-9(10)11/h1-6,13-14,21-22H,7-8H2
NCI pathway
Reactome pathway
n/an/a>5.00E+3n/an/an/an/an/an/a
Bristol-Myers Squibb Pharmaceutical Research and Development
Curated by ChEMBL
Assay Description
Antagonist activity at human androgen receptor in MDA453 cells by alkaline phosphatase reporter gene assay
Bioorg Med Chem Lett 18: 1910-5 (2008)
Article DOI: 10.1016/j.bmcl.2008.02.006
BindingDB Entry DOI: 10.7270/Q2DJ5GGT