BDBM50372197 CHEMBL258083
SMILES: CCC[C@H]1CCN[C@H](C1)[C@@H](O)[C@H](Cc1cc(F)cc(F)c1)NC(=O)c1cc(C)cc(c1)C(=O)N(CCC)CCC
InChI Key: InChIKey=MMSXGVAPNNIHSW-GEYQZXRLSA-N
Data: 2 IC50
Activity Spreadsheet -- Enzyme Inhibition Constant Data from BindingDB
Found 2 hits for monomerid = 50372197
Trg + Lig
Ki
nM
ΔG°
kcal/mole
IC50
nM
Kd
nM
EC50/IC50
nM
koff
s-1
kon
M-1s-1
pHTemp
°C
Beta-secretase 1
(Homo sapiens (Human))
BDBM50372197
(CHEMBL258083)
Show SMILES CCC[C@H]1CCN[C@H](C1)[C@@H](O)[C@H](Cc1cc(F)cc(F)c1)NC(=O)c1cc(C)cc(c1)C(=O)N(CCC)CCC
Show InChI InChI=1S/C32H45F2N3O3/c1-5-8-22-9-10-35-28(17-22)30(38)29(18-23-15-26(33)20-27(34)16-23)36-31(39)24-13-21(4)14-25(19-24)32(40)37(11-6-2)12-7-3/h13-16,19-20,22,28-30,35,38H,5-12,17-18H2,1-4H3,(H,36,39)/t22-,28+,29-,30+/m0/s1
n/an/a 70n/an/an/an/an/an/a
Schering-Plough Research Institute
Curated by ChEMBL
Assay Description
Inhibition of human BACE1
Bioorg Med Chem Lett 18: 414-7 (2008)
Article DOI: 10.1016/j.bmcl.2007.10.116
BindingDB Entry DOI: 10.7270/Q2RV0PJH
Beta-secretase 1
(Homo sapiens (Human))
BDBM50372197
(CHEMBL258083)
Show SMILES CCC[C@H]1CCN[C@H](C1)[C@@H](O)[C@H](Cc1cc(F)cc(F)c1)NC(=O)c1cc(C)cc(c1)C(=O)N(CCC)CCC
Show InChI InChI=1S/C32H45F2N3O3/c1-5-8-22-9-10-35-28(17-22)30(38)29(18-23-15-26(33)20-27(34)16-23)36-31(39)24-13-21(4)14-25(19-24)32(40)37(11-6-2)12-7-3/h13-16,19-20,22,28-30,35,38H,5-12,17-18H2,1-4H3,(H,36,39)/t22-,28+,29-,30+/m0/s1
n/an/a 1.20E+3n/an/an/an/an/an/a
Schering-Plough Research Institute
Curated by ChEMBL
Assay Description
Inhibition of human BACE1 assessed as amyloid beta 40 production in human HEK293 cells by ELISA
Bioorg Med Chem Lett 18: 414-7 (2008)
Article DOI: 10.1016/j.bmcl.2007.10.116
BindingDB Entry DOI: 10.7270/Q2RV0PJH