BDBM50372263 CHEMBL256000
SMILES: CCCOc1ccc(cc1)-c1ccc(-c2ccccc2Cl)n1CC(=O)NC(=N)NCCCC(N)=O
InChI Key: InChIKey=MYRWJPSGSVKXQC-UHFFFAOYSA-N
Data: 1 IC50
Activity Spreadsheet -- Enzyme Inhibition Constant Data from BindingDB
Found 1 hit for monomerid = 50372263
Trg + Lig
Ki
nM
ΔG°
kcal/mole
IC50
nM
Kd
nM
EC50/IC50
nM
koff
s-1
kon
M-1s-1
pHTemp
°C
Beta-secretase 1
(Homo sapiens (Human))
BDBM50372263
(CHEMBL256000)
Show SMILES CCCOc1ccc(cc1)-c1ccc(-c2ccccc2Cl)n1CC(=O)NC(=N)NCCCC(N)=O
Show InChI InChI=1S/C26H30ClN5O3/c1-2-16-35-19-11-9-18(10-12-19)22-13-14-23(20-6-3-4-7-21(20)27)32(22)17-25(34)31-26(29)30-15-5-8-24(28)33/h3-4,6-7,9-14H,2,5,8,15-17H2,1H3,(H2,28,33)(H3,29,30,31,34)
n/an/a 137n/an/an/an/an/an/a
Wyeth Research
Curated by ChEMBL
Assay Description
Inhibition of BACE1
Bioorg Med Chem Lett 18: 767-71 (2008)
Article DOI: 10.1016/j.bmcl.2007.11.043
BindingDB Entry DOI: 10.7270/Q27S7PK8