BDBM50372264 CHEMBL430034
SMILES: CCCOc1ccc(cc1)-c1ccc(-c2ccccc2Cl)n1CC(=O)NC(=N)NCC(O)CO
InChI Key: InChIKey=SDMVYEVXSWLCQD-UHFFFAOYSA-N
Data: 1 IC50
Activity Spreadsheet -- Enzyme Inhibition Constant Data from BindingDB
Found 1 hit for monomerid = 50372264
Trg + Lig
Ki
nM
ΔG°
kcal/mole
IC50
nM
Kd
nM
EC50/IC50
nM
koff
s-1
kon
M-1s-1
pHTemp
°C
Beta-secretase 1
(Homo sapiens (Human))
BDBM50372264
(CHEMBL430034)
Show SMILES CCCOc1ccc(cc1)-c1ccc(-c2ccccc2Cl)n1CC(=O)NC(=N)NCC(O)CO
Show InChI InChI=1S/C25H29ClN4O4/c1-2-13-34-19-9-7-17(8-10-19)22-11-12-23(20-5-3-4-6-21(20)26)30(22)15-24(33)29-25(27)28-14-18(32)16-31/h3-12,18,31-32H,2,13-16H2,1H3,(H3,27,28,29,33)
n/an/a 124n/an/an/an/an/an/a
Wyeth Research
Curated by ChEMBL
Assay Description
Inhibition of BACE1
Bioorg Med Chem Lett 18: 767-71 (2008)
Article DOI: 10.1016/j.bmcl.2007.11.043
BindingDB Entry DOI: 10.7270/Q27S7PK8